Uploaded image for project: 'MariaDB Server'
  1. MariaDB Server
  2. MDEV-6790

10.1: debian build failure

    XMLWordPrintable

    Details

      Description

      $ ./debian/autobake-deb.sh
      ...
      dpkg-source: info: building mariadb-10.1 in mariadb-10.1_10.1.1+maria-1~precise.tar.gz
      dpkg-source: info: building mariadb-10.1 in mariadb-10.1_10.1.1+maria-1~precise.dsc
       debian/rules build
      test -d debian/patched || install -d debian/patched
      dpatch  apply-all  
      applying patch 33_scripts__mysql_create_system_tables__no_test to ./ ... failed.
      make: *** [patch-stamp] Error 1
      dpkg-buildpackage: error: debian/rules build gave error exit status 2
      ..
       
      $ cat debian/patched/33_scripts__mysql_create_system_tables__no_test.dpatch.failed 
      patching file scripts/mysql_system_tables_data.sql
      Hunk #2 FAILED at 33.
      1 out of 2 hunks FAILED -- saving rejects to file scripts/mysql_system_tables_data.sql.rej
      md5sum: 1d5e0e3d83c3469c9aba249ea686acf0  /home/nirbhay/project/git-repo/tmp/10.1/debian/patches/33_scripts__mysql_create_system_tables__no_test.dpatch

        Attachments

          Activity

            People

            Assignee:
            nirbhay_c Nirbhay Choubey (Inactive)
            Reporter:
            nirbhay_c Nirbhay Choubey (Inactive)
            Votes:
            0 Vote for this issue
            Watchers:
            2 Start watching this issue

              Dates

              Created:
              Updated:
              Resolved: