Details

    • Sprint:
      10.0.30

      Description

      $ cmake ../mariadb-server/  -DCMAKE_C_COMPILER_LAUNCHER=ccache -DCMAKE_CXX_COMPILER_LAUNCHER=ccache  -DCMAKE_BUILD_TYPE=Debug   -DDOWNLOAD_BOOST=1 -DWITH_BOOST=${HOME}/build_boost -DCMAKE_C_COMPILER=${CC:-gcc} -DCMAKE_CXX_COMPILER=${CXX:-g++}  -DCMAKE_C_FLAGS_RELWITHDEBINFO="-O3 -g"  -DCMAKE_CXX_FLAGS_RELWITHDEBINFO="-O3 -g"  -DWITH_SSL=system -DCMAKE_INSTALL_PREFIX=/usr/local/mariadb-10.0
      -- The C compiler identification is GNU 6.3.1
      -- The CXX compiler identification is GNU 6.3.1
      -- Check for working C compiler: /usr/lib64/ccache/gcc
      -- Check for working C compiler: /usr/lib64/ccache/gcc -- works
      -- Detecting C compiler ABI info
      -- Detecting C compiler ABI info - done
      -- Detecting C compile features
      -- Detecting C compile features - done
      -- Check for working CXX compiler: /usr/lib64/ccache/g++
      -- Check for working CXX compiler: /usr/lib64/ccache/g++ -- works
      -- Detecting CXX compiler ABI info
      -- Detecting CXX compiler ABI info - done
      -- Detecting CXX compile features
      -- Detecting CXX compile features - done
      -- Looking for SHM_HUGETLB
      -- Looking for SHM_HUGETLB - found
      -- MariaDB 10.0.30
      -- Looking for sys/types.h
      -- Looking for sys/types.h - found
      -- Looking for stdint.h
      -- Looking for stdint.h - found
      -- Looking for stddef.h
      -- Looking for stddef.h - found
      -- Check size of void *
      -- Check size of void * - done
      -- Packaging as: mariadb-10.0.30-Linux-x86_64
      -- Performing Test HAVE_VISIBILITY_HIDDEN
      -- Performing Test HAVE_VISIBILITY_HIDDEN - Success
      -- Performing Test HAVE_GGDB3
      -- Performing Test HAVE_GGDB3 - Success
      -- Looking for floor
      -- Looking for floor - not found
      -- Looking for floor in m
      -- Looking for floor in m - found
      -- Looking for gethostbyname_r
      -- Looking for gethostbyname_r - found
      -- Looking for bind
      -- Looking for bind - found
      -- Looking for crypt
      -- Looking for crypt - not found
      -- Looking for crypt in crypt
      -- Looking for crypt in crypt - found
      -- Looking for setsockopt
      -- Looking for setsockopt - found
      -- Looking for dlopen
      -- Looking for dlopen - not found
      -- Looking for dlopen in dl
      -- Looking for dlopen in dl - found
      -- Looking for sched_yield
      -- Looking for sched_yield - found
      -- Looking for clock_gettime
      -- Looking for clock_gettime - found
      -- Looking for pthread.h
      -- Looking for pthread.h - found
      -- Looking for pthread_create
      -- Looking for pthread_create - not found
      -- Looking for pthread_create in pthreads
      -- Looking for pthread_create in pthreads - not found
      -- Looking for pthread_create in pthread
      -- Looking for pthread_create in pthread - found
      -- Found Threads: TRUE  
      -- Looking for 4 include files stdlib.h, ..., float.h
      -- Looking for 4 include files stdlib.h, ..., float.h - found
      -- Looking for include file alloca.h
      -- Looking for include file alloca.h - found
      -- Looking for include file aio.h
      -- Looking for include file aio.h - found
      -- Looking for include file arpa/inet.h
      -- Looking for include file arpa/inet.h - found
      -- Looking for include file crypt.h
      -- Looking for include file crypt.h - found
      -- Looking for include file bfd.h
      -- Looking for include file bfd.h - found
      -- Looking for include file dirent.h
      -- Looking for include file dirent.h - found
      -- Looking for include file dlfcn.h
      -- Looking for include file dlfcn.h - found
      -- Looking for include file execinfo.h
      -- Looking for include file execinfo.h - found
      -- Looking for include file fcntl.h
      -- Looking for include file fcntl.h - found
      -- Looking for include file fenv.h
      -- Looking for include file fenv.h - found
      -- Looking for include file float.h
      -- Looking for include file float.h - found
      -- Looking for include file floatingpoint.h
      -- Looking for include file floatingpoint.h - not found
      -- Looking for include file fpu_control.h
      -- Looking for include file fpu_control.h - found
      -- Looking for include file grp.h
      -- Looking for include file grp.h - found
      -- Looking for include file ieeefp.h
      -- Looking for include file ieeefp.h - not found
      -- Looking for include file inttypes.h
      -- Looking for include file inttypes.h - found
      -- Looking for include file langinfo.h
      -- Looking for include file langinfo.h - found
      -- Looking for include file linux/unistd.h
      -- Looking for include file linux/unistd.h - found
      -- Looking for include file limits.h
      -- Looking for include file limits.h - found
      -- Looking for include file locale.h
      -- Looking for include file locale.h - found
      -- Looking for include file malloc.h
      -- Looking for include file malloc.h - found
      -- Looking for include file memory.h
      -- Looking for include file memory.h - found
      -- Looking for include file ndir.h
      -- Looking for include file ndir.h - not found
      -- Looking for include file netinet/in.h
      -- Looking for include file netinet/in.h - found
      -- Looking for include file paths.h
      -- Looking for include file paths.h - found
      -- Looking for include file port.h
      -- Looking for include file port.h - not found
      -- Looking for include file poll.h
      -- Looking for include file poll.h - found
      -- Looking for include file pwd.h
      -- Looking for include file pwd.h - found
      -- Looking for include file sched.h
      -- Looking for include file sched.h - found
      -- Looking for include file select.h
      -- Looking for include file select.h - not found
      -- Looking for include file semaphore.h
      -- Looking for include file semaphore.h - found
      -- Looking for include files sys/types.h, sys/dir.h
      -- Looking for include files sys/types.h, sys/dir.h - found
      -- Looking for include files sys/types.h, sys/event.h
      -- Looking for include files sys/types.h, sys/event.h - not found
      -- Looking for include file sys/ndir.h
      -- Looking for include file sys/ndir.h - not found
      -- Looking for include file sys/pte.h
      -- Looking for include file sys/pte.h - not found
      -- Looking for include file stdlib.h
      -- Looking for include file stdlib.h - found
      -- Looking for include file strings.h
      -- Looking for include file strings.h - found
      -- Looking for include file string.h
      -- Looking for include file string.h - found
      -- Looking for include file synch.h
      -- Looking for include file synch.h - not found
      -- Looking for include file sysent.h
      -- Looking for include file sysent.h - not found
      -- Looking for include file sys/cdefs.h
      -- Looking for include file sys/cdefs.h - found
      -- Looking for include file sys/file.h
      -- Looking for include file sys/file.h - found
      -- Looking for include file sys/fpu.h
      -- Looking for include file sys/fpu.h - not found
      -- Looking for include file sys/ioctl.h
      -- Looking for include file sys/ioctl.h - found
      -- Looking for include files sys/types.h, sys/ipc.h
      -- Looking for include files sys/types.h, sys/ipc.h - found
      -- Looking for include files sys/types.h, sys/malloc.h
      -- Looking for include files sys/types.h, sys/malloc.h - not found
      -- Looking for include file sys/mman.h
      -- Looking for include file sys/mman.h - found
      -- Looking for include file sys/prctl.h
      -- Looking for include file sys/prctl.h - found
      -- Looking for include file sys/resource.h
      -- Looking for include file sys/resource.h - found
      -- Looking for include file sys/select.h
      -- Looking for include file sys/select.h - found
      -- Looking for include files sys/types.h, sys/shm.h
      -- Looking for include files sys/types.h, sys/shm.h - found
      -- Looking for include file sys/socket.h
      -- Looking for include file sys/socket.h - found
      -- Looking for include file sys/stat.h
      -- Looking for include file sys/stat.h - found
      -- Looking for include file sys/stream.h
      -- Looking for include file sys/stream.h - not found
      -- Looking for include file sys/termcap.h
       
      -- Looking for include file sys/termcap.h - not found
      -- Looking for include file asm/termbits.h
      -- Looking for include file asm/termbits.h - found
      -- Looking for include file termbits.h
      -- Looking for include file termbits.h - not found
      -- Looking for include file termios.h
      -- Looking for include file termios.h - found
      -- Looking for include file termio.h
      -- Looking for include file termio.h - found
      -- Looking for include file termcap.h
      -- Looking for include file termcap.h - found
      -- Looking for include file unistd.h
      -- Looking for include file unistd.h - found
      -- Looking for include file utime.h
      -- Looking for include file utime.h - found
      -- Looking for include file varargs.h
      -- Looking for include file varargs.h - not found
      -- Looking for include file sys/time.h
      -- Looking for include file sys/time.h - found
      -- Looking for include file sys/utime.h
      -- Looking for include file sys/utime.h - not found
      -- Looking for include file sys/wait.h
      -- Looking for include file sys/wait.h - found
      -- Looking for include file sys/param.h
      -- Looking for include file sys/param.h - found
      -- Looking for include file sys/vadvise.h
      -- Looking for include file sys/vadvise.h - not found
      -- Looking for include file fnmatch.h
      -- Looking for include file fnmatch.h - found
      -- Looking for include file stdarg.h
      -- Looking for include file stdarg.h - found
      -- Looking for include files stdlib.h, sys/un.h
      -- Looking for include files stdlib.h, sys/un.h - found
      -- Looking for include file vis.h
      -- Looking for include file vis.h - not found
      -- Looking for include file wchar.h
      -- Looking for include file wchar.h - found
      -- Looking for include file wctype.h
      -- Looking for include file wctype.h - found
      -- Looking for include file sys/sockio.h
      -- Looking for include file sys/sockio.h - not found
      -- Looking for include file sys/utsname.h
      -- Looking for include file sys/utsname.h - found
      -- Looking for include file sys/ptem.h
      -- Looking for include file sys/ptem.h - not found
      -- Performing Test HAVE_WERROR_FLAG
      -- Performing Test HAVE_WERROR_FLAG - Success
      -- Performing Test HAVE_PTHREAD_ONCE_INIT
      -- Performing Test HAVE_PTHREAD_ONCE_INIT - Success
      -- Looking for access
      -- Looking for access - found
      -- Looking for aio_read
      -- Looking for aio_read - not found
      -- Looking for alarm
      -- Looking for alarm - found
      -- Looking for backtrace
      -- Looking for backtrace - found
      -- Looking for backtrace_symbols
      -- Looking for backtrace_symbols - found
      -- Looking for backtrace_symbols_fd
      -- Looking for backtrace_symbols_fd - found
      -- Looking for printstack
      -- Looking for printstack - not found
      -- Looking for bfill
      -- Looking for bfill - not found
      -- Looking for bmove
      -- Looking for bmove - not found
      -- Looking for bsearch
      -- Looking for bsearch - found
      -- Looking for index
      -- Looking for index - found
      -- Looking for bzero
      -- Looking for bzero - found
      -- Looking for clock_gettime
      -- Looking for clock_gettime - found
      -- Looking for cuserid
      -- Looking for cuserid - found
      -- Looking for directio
      -- Looking for directio - not found
      -- Looking for _doprnt
      -- Looking for _doprnt - not found
      -- Looking for flockfile
      -- Looking for flockfile - found
      -- Looking for ftruncate
      -- Looking for ftruncate - found
      -- Looking for getline
      -- Looking for getline - found
      -- Looking for compress
      -- Looking for compress - not found
      -- Looking for crypt
      -- Looking for crypt - found
      -- Looking for dlerror
      -- Looking for dlerror - found
      -- Looking for dlopen
      -- Looking for dlopen - found
      -- Looking for fchmod
      -- Looking for fchmod - found
      -- Looking for fcntl
      -- Looking for fcntl - found
      -- Looking for fconvert
      -- Looking for fconvert - not found
      -- Looking for fdatasync
      -- Looking for fdatasync - found
      -- Looking for fdatasync
      -- Looking for fdatasync - found
      -- Looking for fesetround
      -- Looking for fesetround - found
      -- Looking for fedisableexcept
      -- Looking for fedisableexcept - found
      -- Looking for fpsetmask
      -- Looking for fpsetmask - not found
      -- Looking for fseeko
      -- Looking for fseeko - found
      -- Looking for fsync
      -- Looking for fsync - found
      -- Looking for getcwd
      -- Looking for getcwd - found
      -- Looking for gethostbyaddr_r
      -- Looking for gethostbyaddr_r - found
      -- Looking for gethrtime
      -- Looking for gethrtime - not found
      -- Looking for getnameinfo
      -- Looking for getnameinfo - found
      -- Looking for getpass
      -- Looking for getpass - found
      -- Looking for getpassphrase
      -- Looking for getpassphrase - not found
      -- Looking for getpwnam
      -- Looking for getpwnam - found
      -- Looking for getpwuid
      -- Looking for getpwuid - found
      -- Looking for getrlimit
      -- Looking for getrlimit - found
      -- Looking for getrusage
      -- Looking for getrusage - found
      -- Looking for getwd
      -- Looking for getwd - found
      -- Looking for gmtime_r
      -- Looking for gmtime_r - found
      -- Looking for initgroups
      -- Looking for initgroups - found
      -- Looking for issetugid
      -- Looking for issetugid - not found
      -- Looking for getuid
      -- Looking for getuid - found
      -- Looking for geteuid
      -- Looking for geteuid - found
      -- Looking for getgid
      -- Looking for getgid - found
      -- Looking for getegid
      -- Looking for getegid - found
      -- Looking for ldiv
      -- Looking for ldiv - found
      -- Looking for localtime_r
      -- Looking for localtime_r - found
      -- Looking for longjmp
      -- Looking for longjmp - found
      -- Looking for lstat
      -- Looking for lstat - found
      -- Looking for madvise
      -- Looking for madvise - found
      -- Looking for mallinfo
      -- Looking for mallinfo - found
      -- Looking for memcpy
      -- Looking for memcpy - found
      -- Looking for memmove
      -- Looking for memmove - found
      -- Looking for mkstemp
      -- Looking for mkstemp - found
      -- Looking for mlock
      -- Looking for mlock - found
      -- Looking for mlockall
      -- Looking for mlockall - found
      -- Looking for mmap
      -- Looking for mmap - found
      -- Looking for mmap64
      -- Looking for mmap64 - found
      -- Looking for perror
      -- Looking for perror - found
      -- Looking for poll
      -- Looking for poll - found
      -- Looking for port_create
      -- Looking for port_create - not found
      -- Looking for posix_fallocate
      -- Looking for posix_fallocate - found
      -- Looking for pread
      -- Looking for pread - found
      -- Looking for pthread_attr_create
      -- Looking for pthread_attr_create - not found
      -- Looking for pthread_attr_getstacksize
      -- Looking for pthread_attr_getstacksize - found
      -- Looking for pthread_attr_setscope
      -- Looking for pthread_attr_setscope - found
      -- Looking for pthread_attr_getguardsize
      -- Looking for pthread_attr_getguardsize - found
      -- Looking for pthread_attr_setstacksize
      -- Looking for pthread_attr_setstacksize - found
      -- Looking for pthread_condattr_create
      -- Looking for pthread_condattr_create - not found
      -- Looking for pthread_condattr_setclock
      -- Looking for pthread_condattr_setclock - found
      -- Looking for pthread_key_delete
      -- Looking for pthread_key_delete - found
      -- Looking for pthread_rwlock_rdlock
      -- Looking for pthread_rwlock_rdlock - found
      -- Looking for pthread_sigmask
      -- Looking for pthread_sigmask - found
      -- Looking for pthread_threadmask
      -- Looking for pthread_threadmask - not found
      -- Looking for pthread_yield_np
      -- Looking for pthread_yield_np - not found
      -- Looking for putenv
      -- Looking for putenv - found
      -- Looking for readdir_r
      -- Looking for readdir_r - found
      -- Looking for readlink
      -- Looking for readlink - found
      -- Looking for re_comp
      -- Looking for re_comp - found
      -- Looking for regcomp
      -- Looking for regcomp - found
      -- Looking for realpath
      -- Looking for realpath - found
      -- Looking for rename
      -- Looking for rename - found
      -- Looking for rwlock_init
      -- Looking for rwlock_init - not found
      -- Looking for sched_yield
      -- Looking for sched_yield - found
      -- Looking for setenv
      -- Looking for setenv - found
      -- Looking for setlocale
      -- Looking for setlocale - found
      -- Looking for setfd
      -- Looking for setfd - not found
      -- Looking for sigaction
      -- Looking for sigaction - found
      -- Looking for sigthreadmask
      -- Looking for sigthreadmask - not found
      -- Looking for sigwait
      -- Looking for sigwait - found
      -- Looking for sigaddset
      -- Looking for sigaddset - found
      -- Looking for sigemptyset
      -- Looking for sigemptyset - found
      -- Looking for sighold
      -- Looking for sighold - found
      -- Looking for sigset
      -- Looking for sigset - found
      -- Looking for sleep
      -- Looking for sleep - found
      -- Looking for snprintf
      -- Looking for snprintf - found
      -- Looking for stpcpy
      -- Looking for stpcpy - found
      -- Looking for strcoll
      -- Looking for strcoll - found
      -- Looking for strerror
      -- Looking for strerror - found
      -- Looking for strlcpy
      -- Looking for strlcpy - not found
      -- Looking for strnlen
      -- Looking for strnlen - found
      -- Looking for strlcat
      -- Looking for strlcat - not found
      -- Looking for strsignal
      -- Looking for strsignal - found
      -- Looking for fgetln
      -- Looking for fgetln - not found
      -- Looking for strpbrk
      -- Looking for strpbrk - found
      -- Looking for strstr
      -- Looking for strstr - found
      -- Looking for strtok_r
      -- Looking for strtok_r - found
      -- Looking for strtol
      -- Looking for strtol - found
      -- Looking for strtoll
      -- Looking for strtoll - found
      -- Looking for strtoul
      -- Looking for strtoul - found
      -- Looking for strtoull
      -- Looking for strtoull - found
      -- Looking for strcasecmp
      -- Looking for strcasecmp - found
      -- Looking for strncasecmp
      -- Looking for strncasecmp - found
      -- Looking for strdup
      -- Looking for strdup - found
      -- Looking for shmat
      -- Looking for shmat - found
      -- Looking for shmctl
      -- Looking for shmctl - found
      -- Looking for shmdt
      -- Looking for shmdt - found
      -- Looking for shmget
      -- Looking for shmget - found
      -- Looking for tell
      -- Looking for tell - not found
      -- Looking for tempnam
      -- Looking for tempnam - found
      -- Looking for thr_setconcurrency
      -- Looking for thr_setconcurrency - not found
      -- Looking for thr_yield
      -- Looking for thr_yield - not found
      -- Looking for vasprintf
      -- Looking for vasprintf - found
      -- Looking for vsnprintf
      -- Looking for vsnprintf - found
      -- Looking for vprintf
      -- Looking for vprintf - found
      -- Looking for valloc
      -- Looking for valloc - found
      -- Looking for memalign
      -- Looking for memalign - found
      -- Looking for chown
      -- Looking for chown - found
      -- Looking for nl_langinfo
      -- Looking for nl_langinfo - found
      -- Looking for include file time.h
      -- Looking for include file time.h - found
      -- Looking for include file sys/times.h
      -- Looking for include file sys/times.h - found
      -- Looking for include file asm/msr.h
      -- Looking for include file asm/msr.h - found
      -- Looking for include file ia64intrin.h
      -- Looking for include file ia64intrin.h - not found
      -- Looking for times
      -- Looking for times - found
      -- Looking for gettimeofday
      -- Looking for gettimeofday - found
      -- Looking for read_real_time
      -- Looking for read_real_time - not found
      -- Looking for ftime
      -- Looking for ftime - found
      -- Looking for time
      -- Looking for time - found
      -- Looking for rdtscll
      -- Looking for rdtscll - not found
      -- Looking for madvise
      -- Looking for madvise - found
      -- Looking for tzname
      -- Looking for tzname - found
      -- Looking for lrand48
      -- Looking for lrand48 - found
      -- Looking for getpagesize
      -- Looking for getpagesize - found
      -- Looking for TIOCGWINSZ
      -- Looking for TIOCGWINSZ - found
      -- Looking for FIONREAD
      -- Looking for FIONREAD - found
      -- Looking for TIOCSTAT
      -- Looking for TIOCSTAT - not found
      -- Looking for FIONREAD
      -- Looking for FIONREAD - not found
      -- Looking for finite
      -- Looking for finite - found
      -- Looking for log2
      -- Looking for log2 - found
      -- Looking for isnan
      -- Looking for isnan - found
      -- Looking for rint
      -- Looking for rint - found
      -- Performing Test HAVE_ISINF
      -- Performing Test HAVE_ISINF - Success
      -- Check if the system is big endian
      -- Searching 16 bit integer
      -- Check size of unsigned short
      -- Check size of unsigned short - done
      -- Using unsigned short
      -- Check if the system is big endian - little endian
      -- Check size of sigset_t
      -- Check size of sigset_t - done
      -- Check size of mode_t
      -- Check size of mode_t - done
      -- Check size of sighandler_t
      -- Check size of sighandler_t - done
      -- Check size of in_addr_t
      -- Check size of in_addr_t - done
      -- Check size of char *
      -- Check size of char * - done
      -- Check size of long
      -- Check size of long - done
      -- Check size of size_t
      -- Check size of size_t - done
      -- Check size of char
      -- Check size of char - done
      -- Check size of short
      -- Check size of short - done
      -- Check size of int
      -- Check size of int - done
      -- Check size of long long
      -- Check size of long long - done
      -- Check size of off_t
      -- Check size of off_t - done
      -- Check size of uchar
      -- Check size of uchar - failed
      -- Check size of uint
      -- Check size of uint - done
      -- Check size of ulong
      -- Check size of ulong - done
      -- Check size of int8
      -- Check size of int8 - failed
      -- Check size of uint8
      -- Check size of uint8 - failed
      -- Check size of int16
      -- Check size of int16 - failed
      -- Check size of uint16
      -- Check size of uint16 - failed
      -- Check size of int32
      -- Check size of int32 - failed
      -- Check size of uint32
      -- Check size of uint32 - failed
      -- Check size of u_int32_t
      -- Check size of u_int32_t - done
      -- Check size of int64
      -- Check size of int64 - failed
      -- Check size of uint64
      -- Check size of uint64 - failed
      -- Check size of time_t
      -- Check size of time_t - done
      -- Check size of bool
      -- Check size of bool - failed
      -- Check size of socklen_t
      -- Check size of socklen_t - done
      -- Performing Test TIME_T_UNSIGNED
      -- Performing Test TIME_T_UNSIGNED - Failed
      -- Performing Test HAVE_GETADDRINFO
      -- Performing Test HAVE_GETADDRINFO - Success
      -- Performing Test HAVE_SELECT
      -- Performing Test HAVE_SELECT - Success
      -- Performing Test HAVE_TIMESPEC_TS_SEC
      -- Performing Test HAVE_TIMESPEC_TS_SEC - Failed
      -- Performing Test QSORT_TYPE_IS_VOID
      -- Performing Test QSORT_TYPE_IS_VOID - Success
      -- Performing Test HAVE_SOCKET_SIZE_T_AS_socklen_t
      -- Performing Test HAVE_SOCKET_SIZE_T_AS_socklen_t - Success
      -- Performing Test HAVE_PTHREAD_YIELD_ZERO_ARG
      -- Performing Test HAVE_PTHREAD_YIELD_ZERO_ARG - Success
      -- Checking stack direction : -1
      -- Performing Test SIGNAL_RETURN_TYPE_IS_VOID
      -- Performing Test SIGNAL_RETURN_TYPE_IS_VOID - Success
      -- Looking for include files time.h, sys/time.h
      -- Looking for include files time.h, sys/time.h - found
      -- Looking for O_NONBLOCK
      -- Looking for O_NONBLOCK - found
      -- Performing Test C_HAS_inline
      -- Performing Test C_HAS_inline - Success
      -- Performing Test HAVE_PAUSE_INSTRUCTION
      -- Performing Test HAVE_PAUSE_INSTRUCTION - Success
      -- Looking for tcgetattr
      -- Looking for tcgetattr - found
      -- Performing Test HAVE_POSIX_SIGNALS
      -- Performing Test HAVE_POSIX_SIGNALS - Success
      -- Performing Test HAVE_ABI_CXA_DEMANGLE
      -- Performing Test HAVE_ABI_CXA_DEMANGLE - Success
      -- Performing Test HAVE_BSS_START
      -- Performing Test HAVE_BSS_START - Success
      -- Performing Test HAVE_WEAK_SYMBOL
      -- Performing Test HAVE_WEAK_SYMBOL - Success
      -- Performing Test HAVE_CXX_NEW
      -- Performing Test HAVE_CXX_NEW - Success
      -- Performing Test HAVE_SOLARIS_STYLE_GETHOST
      -- Performing Test HAVE_SOLARIS_STYLE_GETHOST - Failed
      -- Performing Test HAVE_GCC_ATOMIC_BUILTINS
      -- Performing Test HAVE_GCC_ATOMIC_BUILTINS - Success
      -- Performing Test HAVE_GCC_C11_ATOMICS
      -- Performing Test HAVE_GCC_C11_ATOMICS - Success
      -- Looking for include files valgrind/memcheck.h, valgrind/valgrind.h
      -- Looking for include files valgrind/memcheck.h, valgrind/valgrind.h - not found
      -- Looking for netinet/in6.h
      -- Looking for netinet/in6.h - not found
      -- Check size of struct sockaddr_in6
      -- Check size of struct sockaddr_in6 - done
      -- Check size of struct in6_addr
      -- Check size of struct in6_addr - done
      -- Performing Test HAVE_SOCKADDR_STORAGE_SS_FAMILY
      -- Performing Test HAVE_SOCKADDR_STORAGE_SS_FAMILY - Success
      -- Performing Test HAVE_SOCKADDR_IN_SIN_LEN
      -- Performing Test HAVE_SOCKADDR_IN_SIN_LEN - Failed
      -- Performing Test HAVE_SOCKADDR_IN6_SIN6_LEN
      -- Performing Test HAVE_SOCKADDR_IN6_SIN6_LEN - Failed
      -- Performing Test STRUCT_DIRENT_HAS_D_INO
      -- Performing Test STRUCT_DIRENT_HAS_D_INO - Success
      -- Performing Test STRUCT_DIRENT_HAS_D_NAMLEN
      -- Performing Test STRUCT_DIRENT_HAS_D_NAMLEN - Failed
      -- Looking for ucontext.h
      -- Looking for ucontext.h - found
      -- Performing Test STRUCT_TIMESPEC_HAS_TV_SEC
      -- Performing Test STRUCT_TIMESPEC_HAS_TV_SEC - Success
      -- Performing Test STRUCT_TIMESPEC_HAS_TV_NSEC
      -- Performing Test STRUCT_TIMESPEC_HAS_TV_NSEC - Success
      -- Found ZLIB: /usr/lib64/libz.so (found version "1.2.8") 
      -- Looking for crc32
      -- Looking for crc32 - found
      -- Looking for compressBound
      -- Looking for compressBound - found
      -- Looking for deflateBound
      -- Looking for deflateBound - found
      -- suffixes <.so;.a>
      -- Looking for SHA512_DIGEST_LENGTH
      -- Looking for SHA512_DIGEST_LENGTH - found
      -- OPENSSL_INCLUDE_DIR = /usr/include
      -- OPENSSL_LIBRARIES = /usr/lib64/libssl.so
      -- CRYPTO_LIBRARY = /usr/lib64/libcrypto.so
      -- OPENSSL_MAJOR_VERSION = 
      -- SSL_LIBRARIES = /usr/lib64/libssl.so;/usr/lib64/libcrypto.so;dl
      -- Looking for ERR_remove_thread_state
      -- Looking for ERR_remove_thread_state - found
      -- Check size of mbstate_t
      -- Check size of mbstate_t - done
      -- Performing Test HAVE_LANGINFO_CODESET
      -- Performing Test HAVE_LANGINFO_CODESET - Success
      -- Looking for mbrlen
      -- Looking for mbrlen - found
      -- Looking for mbscmp
      -- Looking for mbscmp - not found
      -- Looking for mbsrtowcs
      -- Looking for mbsrtowcs - found
      -- Looking for wcrtomb
      -- Looking for wcrtomb - found
      -- Looking for mbrtowc
      -- Looking for mbrtowc - found
      -- Looking for wcscoll
      -- Looking for wcscoll - found
      -- Looking for wcsdup
      -- Looking for wcsdup - found
      -- Looking for wcwidth
      -- Looking for wcwidth - found
      -- Looking for wctype
      -- Looking for wctype - found
      -- Looking for iswlower
      -- Looking for iswlower - found
      -- Looking for iswupper
      -- Looking for iswupper - found
      -- Looking for towlower
      -- Looking for towlower - found
      -- Looking for towupper
      -- Looking for towupper - found
      -- Looking for iswctype
      -- Looking for iswctype - found
      -- Check size of wchar_t
      -- Check size of wchar_t - done
      -- Check size of wctype_t
      -- Check size of wctype_t - done
      -- Check size of wint_t
      -- Check size of wint_t - done
      -- Found Curses: /usr/lib64/libcurses.so  
      -- Looking for tputs in /usr/lib64/libcurses.so
      -- Looking for tputs in /usr/lib64/libcurses.so - found
      -- Looking for setupterm in /usr/lib64/libcurses.so
      -- Looking for setupterm in /usr/lib64/libcurses.so - found
      -- Looking for vidattr in /usr/lib64/libcurses.so
      -- Looking for vidattr in /usr/lib64/libcurses.so - found
      -- Performing Test NEW_READLINE_INTERFACE
      -- Performing Test NEW_READLINE_INTERFACE - Success
      -- Performing Test READLINE_V5
      -- Performing Test READLINE_V5 - Failed
      -- Looking for include files curses.h, term.h
      -- Looking for include files curses.h, term.h - found
      -- Looking for malloc_stats_print in jemalloc
      -- Looking for malloc_stats_print in jemalloc - found
      -- Looking for pcre_stack_guard in pcre
      -- Looking for pcre_stack_guard in pcre - found
      -- Performing Test HAVE_WVLA
      -- Performing Test HAVE_WVLA - Success
      -- Found LibXml2: /usr/lib64/libxml2.so (found version "2.9.3") 
      -- Found Java: /usr/bin/java (found suitable version "1.8.0.121", minimum required is "1.6") 
      -- Found JNI: /usr/lib/jvm/jre/lib/amd64/libjawt.so  
      -- Looking for include file libaio.h
      -- Looking for include file libaio.h - found
      -- Looking for io_queue_init in aio
      -- Looking for io_queue_init in aio - found
      -- Looking for sched_getcpu
      -- Looking for sched_getcpu - found
      -- Performing Test HAVE_IB_GCC_ATOMIC_BUILTINS
      -- Performing Test HAVE_IB_GCC_ATOMIC_BUILTINS - Success
      -- Performing Test HAVE_IB_GCC_ATOMIC_BUILTINS_BYTE
      -- Performing Test HAVE_IB_GCC_ATOMIC_BUILTINS_BYTE - Success
      -- Performing Test HAVE_IB_GCC_ATOMIC_BUILTINS_64
      -- Performing Test HAVE_IB_GCC_ATOMIC_BUILTINS_64 - Success
      -- Performing Test HAVE_IB_GCC_SYNC_SYNCHRONISE
      -- Performing Test HAVE_IB_GCC_SYNC_SYNCHRONISE - Success
      -- Performing Test HAVE_IB_GCC_ATOMIC_THREAD_FENCE
      -- Performing Test HAVE_IB_GCC_ATOMIC_THREAD_FENCE - Success
      -- Performing Test HAVE_IB_GCC_ATOMIC_TEST_AND_SET
      -- Performing Test HAVE_IB_GCC_ATOMIC_TEST_AND_SET - Success
      -- Performing Test HAVE_IB_ATOMIC_PTHREAD_T_GCC
      -- Performing Test HAVE_IB_ATOMIC_PTHREAD_T_GCC - Success
      -- Performing Test HAVE_C99_INITIALIZERS
      -- Performing Test HAVE_C99_INITIALIZERS - Success
      -- Looking for asprintf
      -- Looking for asprintf - found
      -- Check size of pthread_t
      -- Check size of pthread_t - done
      -- Check if the system is big endian
      -- Searching 16 bit integer
      -- Using unsigned short
      -- Check if the system is big endian - little endian
      -- Found PkgConfig: /usr/bin/pkg-config (found version "0.29") 
      -- Performing Test CFLAG_WALL
      -- Performing Test CFLAG_WALL - Success
      -- Performing Test CXXFLAG_WALL
      -- Performing Test CXXFLAG_WALL - Success
      -- Performing Test CFLAG_WEXTRA
      -- Performing Test CFLAG_WEXTRA - Success
      -- Performing Test CXXFLAG_WEXTRA
      -- Performing Test CXXFLAG_WEXTRA - Success
      -- Performing Test CFLAG_WNO_UNUSED_BUT_SET_VARIABLE
      -- Performing Test CFLAG_WNO_UNUSED_BUT_SET_VARIABLE - Success
      -- Performing Test CXXFLAG_WNO_UNUSED_BUT_SET_VARIABLE
      -- Performing Test CXXFLAG_WNO_UNUSED_BUT_SET_VARIABLE - Success
      -- Performing Test CFLAG_WNO_UNUSED_PARAMETER
      -- Performing Test CFLAG_WNO_UNUSED_PARAMETER - Success
      -- Performing Test CXXFLAG_WNO_UNUSED_PARAMETER
      -- Performing Test CXXFLAG_WNO_UNUSED_PARAMETER - Success
      -- Performing Test CFLAG_WNO_SIGN_COMPARE
      -- Performing Test CFLAG_WNO_SIGN_COMPARE - Success
      -- Performing Test CXXFLAG_WNO_SIGN_COMPARE
      -- Performing Test CXXFLAG_WNO_SIGN_COMPARE - Success
      -- Performing Test CFLAG_WNO_POINTER_SIGN
      -- Performing Test CFLAG_WNO_POINTER_SIGN - Success
      -- Performing Test CFLAG_WNO_MISSING_FIELD_INITIALIZERS
      -- Performing Test CFLAG_WNO_MISSING_FIELD_INITIALIZERS - Success
      -- Performing Test CXXFLAG_WNO_MISSING_FIELD_INITIALIZERS
      -- Performing Test CXXFLAG_WNO_MISSING_FIELD_INITIALIZERS - Success
      -- Performing Test CFLAG_WFORMAT_2
      -- Performing Test CFLAG_WFORMAT_2 - Success
      -- Performing Test CXXFLAG_WFORMAT_2
      -- Performing Test CXXFLAG_WFORMAT_2 - Success
      -- Performing Test CFLAG_WSTRICT_ALIASING_2
      -- Performing Test CFLAG_WSTRICT_ALIASING_2 - Success
      -- Performing Test CXXFLAG_WSTRICT_ALIASING_2
      -- Performing Test CXXFLAG_WSTRICT_ALIASING_2 - Success
      -- Performing Test CFLAG_FNO_STRICT_ALIASING
      -- Performing Test CFLAG_FNO_STRICT_ALIASING - Success
      -- Performing Test CXXFLAG_FNO_STRICT_ALIASING
      -- Performing Test CXXFLAG_FNO_STRICT_ALIASING - Success
      -- Performing Test CFLAG_WDISABLED_OPTIMIZATION
      -- Performing Test CFLAG_WDISABLED_OPTIMIZATION - Success
      -- Performing Test CXXFLAG_WDISABLED_OPTIMIZATION
      -- Performing Test CXXFLAG_WDISABLED_OPTIMIZATION - Success
      -- Performing Test CFLAG_WFLOAT_EQUAL
      -- Performing Test CFLAG_WFLOAT_EQUAL - Success
      -- Performing Test CXXFLAG_WFLOAT_EQUAL
      -- Performing Test CXXFLAG_WFLOAT_EQUAL - Success
      -- Performing Test CFLAG_WPOINTER_ARITH
      -- Performing Test CFLAG_WPOINTER_ARITH - Success
      -- Performing Test CXXFLAG_WPOINTER_ARITH
      -- Performing Test CXXFLAG_WPOINTER_ARITH - Success
      -- Performing Test CFLAG_WDECLARATION_AFTER_STATEMENT
      -- Performing Test CFLAG_WDECLARATION_AFTER_STATEMENT - Success
      -- Performing Test CFLAG_WBAD_FUNCTION_CAST
      -- Performing Test CFLAG_WBAD_FUNCTION_CAST - Success
      -- Performing Test CFLAG_WCAST_ALIGN
      -- Performing Test CFLAG_WCAST_ALIGN - Success
      -- Performing Test CXXFLAG_WCAST_ALIGN
      -- Performing Test CXXFLAG_WCAST_ALIGN - Success
      -- Performing Test CFLAG_WREDUNDANT_DECLS
      -- Performing Test CFLAG_WREDUNDANT_DECLS - Success
      -- Performing Test CXXFLAG_WREDUNDANT_DECLS
      -- Performing Test CXXFLAG_WREDUNDANT_DECLS - Success
      -- Performing Test CFLAG_WWRITE_STRINGS
      -- Performing Test CFLAG_WWRITE_STRINGS - Success
      -- Performing Test CXXFLAG_WWRITE_STRINGS
      -- Performing Test CXXFLAG_WWRITE_STRINGS - Success
      -- Performing Test CXXFLAG_FEXCEPTIONS
      -- Performing Test CXXFLAG_FEXCEPTIONS - Success
      -- Performing Test CXXFLAG_FIMPLICIT_TEMPLATES
      -- Performing Test CXXFLAG_FIMPLICIT_TEMPLATES - Success
      -- Performing Test CFLAG_WNO_CLOBBERED
      -- Performing Test CFLAG_WNO_CLOBBERED - Success
      -- Performing Test CXXFLAG_WNO_CLOBBERED
      -- Performing Test CXXFLAG_WNO_CLOBBERED - Success
      -- Looking for errno.h
      -- Looking for errno.h - found
      -- Looking for io.h
      -- Looking for io.h - not found
      -- Looking for netdb.h
      -- Looking for netdb.h - found
      -- Looking for netinet/tcp.h
      -- Looking for netinet/tcp.h - found
      -- Looking for signal.h
      -- Looking for signal.h - found
      -- Looking for sys/sysctl.h
      -- Looking for sys/sysctl.h - found
      -- Looking for _gmtime64_s
      -- Looking for _gmtime64_s - not found
      -- Looking for _localtime64_s
      -- Looking for _localtime64_s - not found
      -- Looking for _stricmp
      -- Looking for _stricmp - not found
      -- Looking for _strnicmp
      -- Looking for _strnicmp - not found
      -- Looking for _strtoui64
      -- Looking for _strtoui64 - not found
      -- Looking for fpclassify
      -- Looking for fpclassify - found
      -- Looking for backtrace in execinfo
      -- Looking for backtrace in execinfo - not found
      -- Looking for clock_gettime in rt
      -- Looking for clock_gettime in rt - found
      -- Looking for __cxa_begin_catch in stdc++
      -- Looking for __cxa_begin_catch in stdc++ - found
      -- Looking for pthread.h
      -- Looking for pthread.h - found
      -- Looking for pthread_mutex_init in pthread
      -- Looking for pthread_mutex_init in pthread - found
      -- Looking for pthread_mutexattr_setpshared
      -- Looking for pthread_mutexattr_setpshared - not found
      -- Looking for pthread_condattr_setpshared
      -- Looking for pthread_condattr_setpshared - not found
      -- Looking for sys/epoll.h
      -- Looking for sys/epoll.h - found
      -- Looking for epoll_create
      -- Looking for epoll_create - found
      -- Looking for compress in z
      -- Looking for compress in z - found
      -- Checking for module 'liblz4'
      --   No package 'liblz4' found
      -- Checking for module 'kytea'
      --   No package 'kytea' found
      -- Looking for libstemmer.h
      -- Looking for libstemmer.h - not found
      -- Looking for sb_stemmer_list in stemmer
      -- Looking for sb_stemmer_list in stemmer - not found
      -- Checking for module 'libzmq'
      --   No package 'libzmq' found
      -- Looking for event_init in event
      -- Looking for event_init in event - not found
      -- Checking for module 'msgpack'
      --   No package 'msgpack' found
      -- Looking for msgpack_version in msgpack
      -- Looking for msgpack_version in msgpack - not found
      -- Configuring OQGraph
      -- Boost version: 1.60.0
      -- Found libjudy: /usr/lib64/libJudy.so
      -- Performing Test BOOST_OK
      -- Performing Test BOOST_OK - Success
      -- OQGraph OK
      -- Performing Test WNO_WRITE_STRING
      -- Performing Test WNO_WRITE_STRING - Success
      -- Performing Test TOKUDB_OK
      -- Performing Test TOKUDB_OK - Success
      -- Performing Test HAVE_STDCXX11
      -- Performing Test HAVE_STDCXX11 - Success
      -- Performing Test HAVE_C__Wno_missing_field_initializers
      -- Performing Test HAVE_C__Wno_missing_field_initializers - Success
      -- Performing Test HAVE_CXX__Wno_missing_field_initializers
      -- Performing Test HAVE_CXX__Wno_missing_field_initializers - Success
      -- Performing Test HAVE_C__Wno_vla
      -- Performing Test HAVE_C__Wno_vla - Success
      -- Performing Test HAVE_CXX__Wno_vla
      -- Performing Test HAVE_CXX__Wno_vla - Success
      -- Looking for include file bits/functexcept.h
      -- Looking for include file bits/functexcept.h - not found
      -- Looking for include file byteswap.h
      -- Looking for include file byteswap.h - found
      -- Looking for include file endian.h
      -- Looking for include file endian.h - found
      -- Looking for include file libkern/OSAtomic.h
      -- Looking for include file libkern/OSAtomic.h - not found
      -- Looking for include file libkern/OSByteOrder.h
      -- Looking for include file libkern/OSByteOrder.h - not found
      -- Looking for include file machine/endian.h
      -- Looking for include file machine/endian.h - not found
      -- Looking for include file malloc/malloc.h
      -- Looking for include file malloc/malloc.h - not found
      -- Looking for include file malloc_np.h
      -- Looking for include file malloc_np.h - not found
      -- Looking for include file pthread_np.h
      -- Looking for include file pthread_np.h - not found
      -- Looking for include file syscall.h
      -- Looking for include file syscall.h - found
      -- Looking for include file sys/endian.h
      -- Looking for include file sys/endian.h - not found
      -- Looking for include file sys/statvfs.h
      -- Looking for include file sys/statvfs.h - found
      -- Looking for include file sys/syscall.h
      -- Looking for include file sys/syscall.h - found
      -- Looking for include file sys/syslimits.h
      -- Looking for include file sys/syslimits.h - not found
      -- Looking for M_MMAP_THRESHOLD
      -- Looking for M_MMAP_THRESHOLD - found
      -- Looking for CLOCK_REALTIME
      -- Looking for CLOCK_REALTIME - found
      -- Looking for O_DIRECT
      -- Looking for O_DIRECT - found
      -- Looking for F_NOCACHE
      -- Looking for F_NOCACHE - not found
      -- Looking for MAP_ANONYMOUS
      -- Looking for MAP_ANONYMOUS - found
      -- Looking for PR_SET_PTRACER
      -- Looking for PR_SET_PTRACER - found
      -- Looking for PR_SET_PTRACER_ANY
      -- Looking for PR_SET_PTRACER_ANY - found
      -- Looking for malloc_size
      -- Looking for malloc_size - not found
      -- Looking for malloc_usable_size
      -- Looking for malloc_usable_size - found
      -- Looking for nrand48
      -- Looking for nrand48 - found
      -- Looking for random_r
      -- Looking for random_r - found
      -- Looking for mincore
      -- Looking for mincore - found
      -- Looking for dlsym
      -- Looking for dlsym - not found
      -- Looking for dlsym
      -- Looking for dlsym - found
      -- Looking for backtrace
      -- Looking for backtrace - found
      -- Looking for pthread_rwlockattr_setkind_np
      -- Looking for pthread_rwlockattr_setkind_np - found
      -- Looking for pthread_yield
      -- Looking for pthread_yield - found
      -- Looking for pthread_threadid_np
      -- Looking for pthread_threadid_np - not found
      -- Looking for pthread_getthreadid_np
      -- Looking for pthread_getthreadid_np - not found
      -- Checking prototype pthread_yield for PTHREAD_YIELD_RETURNS_VOID - False
      -- Performing Test PTHREAD_YIELD_RETURNS_INT
      -- Performing Test PTHREAD_YIELD_RETURNS_INT - Success
      -- Performing Test HAVE_GNU_TLS
      -- Performing Test HAVE_GNU_TLS - Success
      -- Performing Test HAVE_C__Wstrict_null_sentinel
      -- Performing Test HAVE_C__Wstrict_null_sentinel - Failed
      -- Performing Test HAVE_CXX__Wstrict_null_sentinel
      -- Performing Test HAVE_CXX__Wstrict_null_sentinel - Success
      -- Performing Test HAVE_C__Winit_self
      -- Performing Test HAVE_C__Winit_self - Success
      -- Performing Test HAVE_CXX__Winit_self
      -- Performing Test HAVE_CXX__Winit_self - Success
      -- Performing Test HAVE_C__Wswitch
      -- Performing Test HAVE_C__Wswitch - Success
      -- Performing Test HAVE_CXX__Wswitch
      -- Performing Test HAVE_CXX__Wswitch - Success
      -- Performing Test HAVE_C__Wtrampolines
      -- Performing Test HAVE_C__Wtrampolines - Success
      -- Performing Test HAVE_CXX__Wtrampolines
      -- Performing Test HAVE_CXX__Wtrampolines - Success
      -- Performing Test HAVE_C__Wlogical_op
      -- Performing Test HAVE_C__Wlogical_op - Success
      -- Performing Test HAVE_CXX__Wlogical_op
      -- Performing Test HAVE_CXX__Wlogical_op - Success
      -- Performing Test HAVE_C__Wmissing_format_attribute
      -- Performing Test HAVE_C__Wmissing_format_attribute - Success
      -- Performing Test HAVE_CXX__Wmissing_format_attribute
      -- Performing Test HAVE_CXX__Wmissing_format_attribute - Success
      -- Performing Test HAVE_C__Wno_error_missing_format_attribute
      -- Performing Test HAVE_C__Wno_error_missing_format_attribute - Success
      -- Performing Test HAVE_CXX__Wno_error_missing_format_attribute
      -- Performing Test HAVE_CXX__Wno_error_missing_format_attribute - Success
      -- Performing Test HAVE_C__Wno_error_address_of_array_temporary
      -- Performing Test HAVE_C__Wno_error_address_of_array_temporary - Failed
      -- Performing Test HAVE_CXX__Wno_error_address_of_array_temporary
      -- Performing Test HAVE_CXX__Wno_error_address_of_array_temporary - Failed
      -- Performing Test HAVE_C__Wno_error_tautological_constant_out_of_range_compare
      -- Performing Test HAVE_C__Wno_error_tautological_constant_out_of_range_compare - Failed
      -- Performing Test HAVE_CXX__Wno_error_tautological_constant_out_of_range_compare
      -- Performing Test HAVE_CXX__Wno_error_tautological_constant_out_of_range_compare - Failed
      -- Performing Test HAVE_C__Wno_error_maybe_uninitialized
      -- Performing Test HAVE_C__Wno_error_maybe_uninitialized - Success
      -- Performing Test HAVE_CXX__Wno_error_maybe_uninitialized
      -- Performing Test HAVE_CXX__Wno_error_maybe_uninitialized - Success
      -- Performing Test HAVE_C__Wno_error_extern_c_compat
      -- Performing Test HAVE_C__Wno_error_extern_c_compat - Failed
      -- Performing Test HAVE_CXX__Wno_error_extern_c_compat
      -- Performing Test HAVE_CXX__Wno_error_extern_c_compat - Failed
      -- Performing Test HAVE_C__fno_rtti
      -- Performing Test HAVE_C__fno_rtti - Failed
      -- Performing Test HAVE_CXX__fno_rtti
      -- Performing Test HAVE_CXX__fno_rtti - Success
      -- Performing Test HAVE_C__fno_exceptions
      -- Performing Test HAVE_C__fno_exceptions - Success
      -- Performing Test HAVE_CXX__fno_exceptions
      -- Performing Test HAVE_CXX__fno_exceptions - Success
      -- Performing Test HAVE_C__Wno_error_nonnull_compare
      -- Performing Test HAVE_C__Wno_error_nonnull_compare - Success
      -- Performing Test HAVE_CXX__Wno_error_nonnull_compare
      -- Performing Test HAVE_CXX__Wno_error_nonnull_compare - Success
      -- Performing Test HAVE_C__Wpacked
      -- Performing Test HAVE_C__Wpacked - Success
      -- Performing Test HAVE_CXX__Wpacked
      -- Performing Test HAVE_CXX__Wpacked - Success
      -- Performing Test HAVE_C__fno_omit_frame_pointer
      -- Performing Test HAVE_C__fno_omit_frame_pointer - Success
      -- Performing Test HAVE_CXX__fno_omit_frame_pointer
      -- Performing Test HAVE_CXX__fno_omit_frame_pointer - Success
      -- Performing Test HAVE_C__Wno_error_strict_overflow
      -- Performing Test HAVE_C__Wno_error_strict_overflow - Success
      -- Performing Test HAVE_CXX__Wno_error_strict_overflow
      -- Performing Test HAVE_CXX__Wno_error_strict_overflow - Success
      -- Performing Test HAVE__Wno_error_strict_overflow
      -- Performing Test HAVE__Wno_error_strict_overflow - Success
      -- Performing Test HAVE_C__Wextra
      -- Performing Test HAVE_C__Wextra - Success
      -- Performing Test HAVE_CXX__Wextra
      -- Performing Test HAVE_CXX__Wextra - Success
      -- Performing Test HAVE_C__Wbad_function_cast
      -- Performing Test HAVE_C__Wbad_function_cast - Success
      -- Performing Test HAVE_CXX__Wbad_function_cast
      -- Performing Test HAVE_CXX__Wbad_function_cast - Failed
      -- Performing Test HAVE_C__Wno_missing_noreturn
      -- Performing Test HAVE_C__Wno_missing_noreturn - Success
      -- Performing Test HAVE_CXX__Wno_missing_noreturn
      -- Performing Test HAVE_CXX__Wno_missing_noreturn - Success
      -- Performing Test HAVE_C__Wstrict_prototypes
      -- Performing Test HAVE_C__Wstrict_prototypes - Success
      -- Performing Test HAVE_CXX__Wstrict_prototypes
      -- Performing Test HAVE_CXX__Wstrict_prototypes - Failed
      -- Performing Test HAVE_C__Wmissing_prototypes
      -- Performing Test HAVE_C__Wmissing_prototypes - Success
      -- Performing Test HAVE_CXX__Wmissing_prototypes
      -- Performing Test HAVE_CXX__Wmissing_prototypes - Failed
      -- Performing Test HAVE_C__Wmissing_declarations
      -- Performing Test HAVE_C__Wmissing_declarations - Success
      -- Performing Test HAVE_CXX__Wmissing_declarations
      -- Performing Test HAVE_CXX__Wmissing_declarations - Success
      -- Performing Test HAVE_C__Wpointer_arith
      -- Performing Test HAVE_C__Wpointer_arith - Success
      -- Performing Test HAVE_CXX__Wpointer_arith
      -- Performing Test HAVE_CXX__Wpointer_arith - Success
      -- Performing Test HAVE_C__Wshadow
      -- Performing Test HAVE_C__Wshadow - Success
      -- Performing Test HAVE_CXX__Wshadow
      -- Performing Test HAVE_CXX__Wshadow - Success
      -- Performing Test HAVE_C__Wcast_align
      -- Performing Test HAVE_C__Wcast_align - Success
      -- Performing Test HAVE_CXX__Wcast_align
      -- Performing Test HAVE_CXX__Wcast_align - Success
      -- Performing Test HAVE_STDCXX0X
      -- Performing Test HAVE_STDCXX0X - Success
      -- Performing Test HAVE_WERROR
      -- Performing Test HAVE_WERROR - Success
      -- Looking for include file security/pam_appl.h
      -- Looking for include file security/pam_appl.h - found
      -- Looking for strndup
      -- Looking for strndup - found
      -- Performing Test HAVE_PEERCRED
      -- Performing Test HAVE_PEERCRED - Success
      -- Performing Test SUPPORTS_VERSION_IN_LINK_SCRIPT
      -- Performing Test SUPPORTS_VERSION_IN_LINK_SCRIPT - Success
      -- Looking for event.h
      -- Looking for event.h - not found
      -- Configuring done
      -- Generating done
       
      $ make -j5 --output-sync=target
      ....
      Scanning dependencies of target centos6-mariadb-pp
      [ 99%] Generating centos6-mariadb.pp
      /usr/bin/checkmodule:  loading policy configuration from /home/dan/repos/mariadb-server/support-files/SELinux/centos6-mariadb.te
      /usr/bin/checkmodule:  Module name mariadb is different than the output base filename centos6-mariadb
      support-files/SELinux/CMakeFiles/centos6-mariadb-pp.dir/build.make:60: recipe for target 'support-files/SELinux/centos6-mariadb.pp' failed
      make[2]: *** [support-files/SELinux/centos6-mariadb.pp] Error 1
      CMakeFiles/Makefile2:9768: recipe for target 'support-files/SELinux/CMakeFiles/centos6-mariadb-pp.dir/all' failed
      make[1]: *** [support-files/SELinux/CMakeFiles/centos6-mariadb-pp.dir/all] Error 2
      Makefile:160: recipe for target 'all' failed
      make: *** [all] Error 2
      

        Attachments

          Issue Links

            Activity

              People

              • Assignee:
                serg Sergei Golubchik
                Reporter:
                danblack Daniel Black
              • Votes:
                0 Vote for this issue
                Watchers:
                1 Start watching this issue

                Dates

                • Created:
                  Updated:
                  Resolved: