Uploaded image for project: 'MariaDB ColumnStore'
  1. MariaDB ColumnStore
  2. MCOL-4964

Columnstore doesn't build with OpenSSL 3

    XMLWordPrintable

    Details

    • Type: Bug
    • Status: Closed (View Workflow)
    • Priority: Critical
    • Resolution: Fixed
    • Affects Version/s: None
    • Fix Version/s: 22.08.1
    • Component/s: Build
    • Labels:
      None

      Description

      preview-10.8-MDEV-25785-openssl3.0 7cd965af9

      cmake . -DPLUGIN_COLUMNSTORE=YES -DWITH_SSL=/home/jenkins/openssl-inst -DOPENSSL_SSL_LIBRARY=/home/jenkins/openssl-inst/lib64/libssl.so -DOPENSSL_CRYPTO_LIBRARY=/home/jenkins/openssl-inst/lib64/libcrypto.so
       
      [ 47%] Linking CXX executable ../../bin/end_to_end_test
      /usr/bin/ld: ../../lib/libjoblist.so: undefined reference to `EVP_CIPHER_key_length'
      /usr/bin/ld: ../../lib/libjoblist.so: undefined reference to `EVP_CIPHER_iv_length'
      /usr/bin/ld: ../../lib/libjoblist.so: undefined reference to `EVP_CIPHER_block_size'
      collect2: error: ld returned 1 exit status
      make[2]: *** [storage/columnstore/columnstore/utils/cloudio/CMakeFiles/end_to_end_test.dir/build.make:128: storage/columnstore/columnstore/bin/end_to_end_test] Error 1
      make[1]: *** [CMakeFiles/Makefile2:7842: storage/columnstore/columnstore/utils/cloudio/CMakeFiles/end_to_end_test.dir/all] Error 2
      make: *** [Makefile:163: all] Error 2
      

        Attachments

          Issue Links

            Activity

              People

              Assignee:
              leonid.fedorov Leonid Fedorov
              Reporter:
              elenst Elena Stepanova
              Votes:
              0 Vote for this issue
              Watchers:
              3 Start watching this issue

                Dates

                Created:
                Updated:
                Resolved:

                  Git Integration

                  Error rendering 'com.xiplink.jira.git.jira_git_plugin:git-issue-webpanel'. Please contact your Jira administrators.