Uploaded image for project: 'MariaDB Server'
  1. MariaDB Server
  2. MDEV-8463

10.0 tree does not build

    XMLWordPrintable

    Details

      Description

      3bbffc211945f99f9bba806e7031bea6b73a1993 turned buildbot red
      http://buildbot.askmonty.org/buildbot/builders/p8-rhel7-bintar/builds/605/steps/compile/logs/stdio

      /home/buildbot/maria-slave/power8-vlp03-bintar/build/storage/xtradb/srv/srv0start.cc: In function ‘bool srv_file_check_mode(const char*)’:
      /home/buildbot/maria-slave/power8-vlp03-bintar/build/storage/xtradb/srv/srv0start.cc:254:38: error: expected ‘)’ before ‘{’ token
         if (stat.type == OS_FILE_TYPE_FILE {
                                            ^
      /home/buildbot/maria-slave/power8-vlp03-bintar/build/storage/xtradb/srv/srv0start.cc:274:2: error: expected primary-expression before ‘}’ token
        } else {
        ^
      /home/buildbot/maria-slave/power8-vlp03-bintar/build/storage/xtradb/srv/srv0start.cc: In function ‘dberr_t open_or_create_data_files(ulint*, lsn_t*, lsn_t*, lsn_t*, lsn_t*, ulint*)’:
      /home/buildbot/maria-slave/power8-vlp03-bintar/build/storage/xtradb/srv/srv0start.cc:943:37: error: too many arguments to function ‘const char* fil_read_first_page(os_file_t, ulint, ulint*, ulint*, lsn_t*, lsn_t*)’
           min_flushed_lsn, max_flushed_lsn);
                                           ^
      In file included from /home/buildbot/maria-slave/power8-vlp03-bintar/build/storage/xtradb/include/dict0mem.ic:28:0,
                       from /home/buildbot/maria-slave/power8-vlp03-bintar/build/storage/xtradb/include/dict0mem.h:1356,
                       from /home/buildbot/maria-slave/power8-vlp03-bintar/build/storage/xtradb/include/dict0dict.h:33,
                       from /home/buildbot/maria-slave/power8-vlp03-bintar/build/storage/xtradb/include/btr0pcur.h:30,
                       from /home/buildbot/maria-slave/power8-vlp03-bintar/build/storage/xtradb/include/row0mysql.h:36,
                       from /home/buildbot/maria-slave/power8-vlp03-bintar/build/storage/xtradb/include/row0ftsort.h:32,
                       from /home/buildbot/maria-slave/power8-vlp03-bintar/build/storage/xtradb/srv/srv0start.cc:43:
      /home/buildbot/maria-slave/power8-vlp03-bintar/build/storage/xtradb/include/fil0fil.h:569:1: note: declared here
       fil_read_first_page(
       ^
      make[2]: *** [storage/xtradb/CMakeFiles/xtradb.dir/srv/srv0start.cc.o] Error 1
      make[1]: *** [storage/xtradb/CMakeFiles/xtradb.dir/all] Error 2
      make[1]: *** Waiting for unfinished jobs....

        Attachments

          Activity

            People

            Assignee:
            jplindst Jan Lindström
            Reporter:
            elenst Elena Stepanova
            Votes:
            0 Vote for this issue
            Watchers:
            1 Start watching this issue

              Dates

              Created:
              Updated:
              Resolved: