Uploaded image for project: 'MariaDB Server'
  1. MariaDB Server
  2. MDEV-6342

build failure on ubuntu

    XMLWordPrintable

    Details

    • Type: Bug
    • Status: Closed (View Workflow)
    • Priority: Major
    • Resolution: Won't Fix
    • Affects Version/s: 5.5.38
    • Fix Version/s: 5.5.54
    • Component/s: Platform Debian
    • Labels:
    • Environment:
      ubuntu - precise
      Linux venus 2.6.32-28-server #55-Ubuntu SMP Mon Jan 10 23:57:16 UTC 2011 x86_64 x86_64 x86_64 GNU/Linux

      Description

      openquery@venus:~/mariadb-5.5-5.5.38+maria$ dpkg-buildpackage -nc -us -uc
      dpkg-buildpackage: export CFLAGS from dpkg-buildflags (origin: vendor): -g -O2 -fstack-protector --param=ssp-buffer-size=4 -Wformat -Wformat-security
      dpkg-buildpackage: export CPPFLAGS from dpkg-buildflags (origin: vendor): -D_FORTIFY_SOURCE=2
      dpkg-buildpackage: export CXXFLAGS from dpkg-buildflags (origin: vendor): -g -O2 -fstack-protector --param=ssp-buffer-size=4 -Wformat -Wformat-security
      dpkg-buildpackage: export FFLAGS from dpkg-buildflags (origin: vendor): -g -O2
      dpkg-buildpackage: export LDFLAGS from dpkg-buildflags (origin: vendor): -Wl,-Bsymbolic-functions -Wl,-z,relro
      dpkg-buildpackage: source package mariadb-5.5
      dpkg-buildpackage: source version 5.5.38+maria-1~precise
      dpkg-buildpackage: source changed by Buildbot <buildbot@ubuntu-precise-amd64>
      dpkg-buildpackage: host architecture amd64
       dpkg-source --before-build mariadb-5.5-5.5.38+maria
       debian/rules build
      test -d debian/patched || install -d debian/patched
      dpatch  apply-all  
      applying patch 33_scripts__mysql_create_system_tables__no_test to ./ ... ok.
      applying patch 38_scripts__mysqld_safe.sh__signals to ./ ... ok.
      applying patch 41_scripts__mysql_install_db.sh__no_test to ./ ... ok.
      applying patch 44_scripts__mysql_config__libs to ./ ... ok.
      applying patch 50_mysql-test__db_test to ./ ... ok.
      applying patch 61_replace_dash_with_bash_mbug675185 to ./ ... ok.
      dpatch  cat-all  >>patch-stampT
      mv -f patch-stampT patch-stamp
      RULES.configure-stamp
      dh_testdir
      if [ ! -d /proc/self ]; then echo "/proc IS NEEDED" 1>&2; exit 1; fi 
      ( test -d builddir || mkdir builddir ) && cd builddir && \
              sh -c 'PATH=${MYSQL_BUILD_PATH:-"/usr/local/bin:/usr/bin:/bin"} \
                              CC=${MYSQL_BUILD_CC:-gcc} \
                              CFLAGS=${MYSQL_BUILD_CFLAGS:-"-O2 -fno-omit-frame-pointer -g -pipe -Wall -Wno-uninitialized"} \
                              CXX=${MYSQL_BUILD_CXX:-g++} \
                              CXXFLAGS=${MYSQL_BUILD_CXXFLAGS:-"-O2 -fno-omit-frame-pointer -g -pipe -Wall -Wno-uninitialized"} \
                      cmake .. \
                      -DMYSQL_SERVER_SUFFIX="-1~precise" \
                      -DBUILD_CONFIG=mysql_release \
                      -DCOMPILATION_COMMENT="mariadb.org binary distribution" \
                      -DSYSTEM_TYPE="debian-linux-gnu" \
                      -DDEB=ubuntu'
      -- Running cmake version 2.8.7
      -- The C compiler identification is GNU
      -- The CXX compiler identification is GNU
      -- Check for working C compiler: /usr/bin/gcc
      -- Check for working C compiler: /usr/bin/gcc -- works
      -- Detecting C compiler ABI info
      -- Detecting C compiler ABI info - done
      -- Check for working CXX compiler: /usr/bin/g++
      -- Check for working CXX compiler: /usr/bin/g++ -- works
      -- Detecting CXX compiler ABI info
      -- Detecting CXX compiler ABI info - done
      -- Looking for sys/types.h
      -- Looking for sys/types.h - found
      -- Looking for stdint.h
      -- Looking for stdint.h - found
      -- Looking for stddef.h
      -- Looking for stddef.h - found
      -- Check size of void *
      -- Check size of void * - done
      -- Looking for include files HAVE_LIBAIO_H
      -- Looking for include files HAVE_LIBAIO_H - found
      -- Looking for io_queue_init in aio
      -- Looking for io_queue_init in aio - found
      -- Looking for SHM_HUGETLB
      -- Looking for SHM_HUGETLB - found
      -- Performing Test HAVE_NO_MISSING_FIELD_INITIALIZERS
      -- Performing Test HAVE_NO_MISSING_FIELD_INITIALIZERS - Success
      -- Performing Test HAVE_DECLARATION_AFTER_STATEMENT
      -- Performing Test HAVE_DECLARATION_AFTER_STATEMENT - Success
      -- MariaDB 5.5.38
      -- Packaging as: mariadb-1~precise-5.5.38-Linux-x86_64
      -- Performing Test HAVE_GGDB3
      -- Performing Test HAVE_GGDB3 - Success
      -- Looking for floor
      -- Looking for floor - not found
      -- Looking for floor in m
      -- Looking for floor in m - found
      -- Looking for gethostbyname_r
      -- Looking for gethostbyname_r - found
      -- Looking for bind
      -- Looking for bind - found
      -- Looking for crypt
      -- Looking for crypt - not found
      -- Looking for crypt in crypt
      -- Looking for crypt in crypt - found
      -- Looking for setsockopt
      -- Looking for setsockopt - found
      -- Looking for dlopen
      -- Looking for dlopen - not found
      -- Looking for dlopen in dl
      -- Looking for dlopen in dl - found
      -- Looking for sched_yield
      -- Looking for sched_yield - found
      -- Looking for clock_gettime
      -- Looking for clock_gettime - not found
      -- Looking for clock_gettime in rt
      -- Looking for clock_gettime in rt - found
      -- Looking for include files CMAKE_HAVE_PTHREAD_H
      -- Looking for include files CMAKE_HAVE_PTHREAD_H - found
      -- Looking for pthread_create in pthreads
      -- Looking for pthread_create in pthreads - not found
      -- Looking for pthread_create in pthread
      -- Looking for pthread_create in pthread - found
      -- Found Threads: TRUE 
      -- Looking for include files STDC_HEADERS
      -- Looking for include files STDC_HEADERS - found
      -- Looking for include files HAVE_ALLOCA_H
      -- Looking for include files HAVE_ALLOCA_H - found
      -- Looking for include files HAVE_AIO_H
      -- Looking for include files HAVE_AIO_H - found
      -- Looking for include files HAVE_ARPA_INET_H
      -- Looking for include files HAVE_ARPA_INET_H - found
      -- Looking for include files HAVE_CRYPT_H
      -- Looking for include files HAVE_CRYPT_H - found
      -- Looking for C++ include cxxabi.h
      -- Looking for C++ include cxxabi.h - found
      -- Looking for include files BFD_H_EXISTS
      -- Looking for include files BFD_H_EXISTS - not found.
      -- Looking for include files HAVE_DIRENT_H
      -- Looking for include files HAVE_DIRENT_H - found
      -- Looking for include files HAVE_DLFCN_H
      -- Looking for include files HAVE_DLFCN_H - found
      -- Looking for include files HAVE_EXECINFO_H
      -- Looking for include files HAVE_EXECINFO_H - found
      -- Looking for include files HAVE_FCNTL_H
      -- Looking for include files HAVE_FCNTL_H - found
      -- Looking for include files HAVE_FENV_H
      -- Looking for include files HAVE_FENV_H - found
      -- Looking for include files HAVE_FLOAT_H
      -- Looking for include files HAVE_FLOAT_H - found
      -- Looking for include files HAVE_FLOATINGPOINT_H
      -- Looking for include files HAVE_FLOATINGPOINT_H - not found.
      -- Looking for include files HAVE_FPU_CONTROL_H
      -- Looking for include files HAVE_FPU_CONTROL_H - found
      -- Looking for include files HAVE_GRP_H
      -- Looking for include files HAVE_GRP_H - found
      -- Looking for include files HAVE_IEEEFP_H
      -- Looking for include files HAVE_IEEEFP_H - not found.
      -- Looking for include files HAVE_INTTYPES_H
      -- Looking for include files HAVE_INTTYPES_H - found
      -- Looking for include files HAVE_LANGINFO_H
      -- Looking for include files HAVE_LANGINFO_H - found
      -- Looking for include files HAVE_LINUX_UNISTD_H
      -- Looking for include files HAVE_LINUX_UNISTD_H - found
      -- Looking for include files HAVE_LIMITS_H
      -- Looking for include files HAVE_LIMITS_H - found
      -- Looking for include files HAVE_LOCALE_H
      -- Looking for include files HAVE_LOCALE_H - found
      -- Looking for include files HAVE_MALLOC_H
      -- Looking for include files HAVE_MALLOC_H - found
      -- Looking for include files HAVE_MEMORY_H
      -- Looking for include files HAVE_MEMORY_H - found
      -- Looking for include files HAVE_NDIR_H
      -- Looking for include files HAVE_NDIR_H - not found.
      -- Looking for include files HAVE_NETINET_IN_H
      -- Looking for include files HAVE_NETINET_IN_H - found
      -- Looking for include files HAVE_PATHS_H
      -- Looking for include files HAVE_PATHS_H - found
      -- Looking for include files HAVE_PORT_H
      -- Looking for include files HAVE_PORT_H - not found.
      -- Looking for include files HAVE_POLL_H
      -- Looking for include files HAVE_POLL_H - found
      -- Looking for include files HAVE_PWD_H
      -- Looking for include files HAVE_PWD_H - found
      -- Looking for include files HAVE_SCHED_H
      -- Looking for include files HAVE_SCHED_H - found
      -- Looking for include files HAVE_SELECT_H
      -- Looking for include files HAVE_SELECT_H - not found.
      -- Looking for include files HAVE_SEMAPHORE_H
      -- Looking for include files HAVE_SEMAPHORE_H - found
      -- Looking for include files HAVE_SYS_DIR_H
      -- Looking for include files HAVE_SYS_DIR_H - found
      -- Looking for include files HAVE_SYS_EVENT_H
      -- Looking for include files HAVE_SYS_EVENT_H - not found.
      -- Looking for include files HAVE_SYS_NDIR_H
      -- Looking for include files HAVE_SYS_NDIR_H - not found.
      -- Looking for include files HAVE_SYS_PTE_H
      -- Looking for include files HAVE_SYS_PTE_H - not found.
      -- Looking for include files HAVE_STDLIB_H
      -- Looking for include files HAVE_STDLIB_H - found
      -- Looking for include files HAVE_STRINGS_H
      -- Looking for include files HAVE_STRINGS_H - found
      -- Looking for include files HAVE_STRING_H
      -- Looking for include files HAVE_STRING_H - found
      -- Looking for include files HAVE_SYNCH_H
      -- Looking for include files HAVE_SYNCH_H - not found.
      -- Looking for include files HAVE_SYSENT_H
      -- Looking for include files HAVE_SYSENT_H - not found.
      -- Looking for include files HAVE_SYS_CDEFS_H
      -- Looking for include files HAVE_SYS_CDEFS_H - found
      -- Looking for include files HAVE_SYS_FILE_H
      -- Looking for include files HAVE_SYS_FILE_H - found
      -- Looking for include files HAVE_SYS_FPU_H
      -- Looking for include files HAVE_SYS_FPU_H - not found.
      -- Looking for include files HAVE_SYS_IOCTL_H
      -- Looking for include files HAVE_SYS_IOCTL_H - found
      -- Looking for include files HAVE_SYS_IPC_H
      -- Looking for include files HAVE_SYS_IPC_H - found
      -- Looking for include files HAVE_SYS_MALLOC_H
      -- Looking for include files HAVE_SYS_MALLOC_H - not found.
      -- Looking for include files HAVE_SYS_MMAN_H
      -- Looking for include files HAVE_SYS_MMAN_H - found
      -- Looking for include files HAVE_SYS_PRCTL_H
      -- Looking for include files HAVE_SYS_PRCTL_H - found
      -- Looking for include files HAVE_SYS_RESOURCE_H
      -- Looking for include files HAVE_SYS_RESOURCE_H - found
      -- Looking for include files HAVE_SYS_SELECT_H
      -- Looking for include files HAVE_SYS_SELECT_H - found
      -- Looking for include files HAVE_SYS_SHM_H
      -- Looking for include files HAVE_SYS_SHM_H - found
      -- Looking for include files HAVE_SYS_SOCKET_H
      -- Looking for include files HAVE_SYS_SOCKET_H - found
      -- Looking for include files HAVE_SYS_STAT_H
      -- Looking for include files HAVE_SYS_STAT_H - found
      -- Looking for include files HAVE_SYS_STREAM_H
      -- Looking for include files HAVE_SYS_STREAM_H - not found.
      -- Looking for include files HAVE_SYS_TERMCAP_H
      -- Looking for include files HAVE_SYS_TERMCAP_H - not found.
      -- Looking for include files HAVE_TERM_H
      -- Looking for include files HAVE_TERM_H - found
      -- Looking for include files HAVE_ASM_TERMBITS_H
      -- Looking for include files HAVE_ASM_TERMBITS_H - found
      -- Looking for include files HAVE_TERMBITS_H
      -- Looking for include files HAVE_TERMBITS_H - not found.
      -- Looking for include files HAVE_TERMIOS_H
      -- Looking for include files HAVE_TERMIOS_H - found
      -- Looking for include files HAVE_TERMIO_H
      -- Looking for include files HAVE_TERMIO_H - found
      -- Looking for include files HAVE_TERMCAP_H
      -- Looking for include files HAVE_TERMCAP_H - found
      -- Looking for include files HAVE_UNISTD_H
      -- Looking for include files HAVE_UNISTD_H - found
      -- Looking for include files HAVE_UTIME_H
      -- Looking for include files HAVE_UTIME_H - found
      -- Looking for include files HAVE_VARARGS_H
      -- Looking for include files HAVE_VARARGS_H - not found.
      -- Looking for include files HAVE_SYS_TIME_H
      -- Looking for include files HAVE_SYS_TIME_H - found
      -- Looking for include files HAVE_SYS_UTIME_H
      -- Looking for include files HAVE_SYS_UTIME_H - not found.
      -- Looking for include files HAVE_SYS_WAIT_H
      -- Looking for include files HAVE_SYS_WAIT_H - found
      -- Looking for include files HAVE_SYS_PARAM_H
      -- Looking for include files HAVE_SYS_PARAM_H - found
      -- Looking for include files HAVE_SYS_VADVISE_H
      -- Looking for include files HAVE_SYS_VADVISE_H - not found.
      -- Looking for include files HAVE_FNMATCH_H
      -- Looking for include files HAVE_FNMATCH_H - found
      -- Looking for include files HAVE_STDARG_H
      -- Looking for include files HAVE_STDARG_H - found
      -- Looking for include files HAVE_SYS_UN_H
      -- Looking for include files HAVE_SYS_UN_H - found
      -- Looking for include files HAVE_VIS_H
      -- Looking for include files HAVE_VIS_H - not found.
      -- Looking for include files HAVE_WCHAR_H
      -- Looking for include files HAVE_WCHAR_H - found
      -- Looking for include files HAVE_WCTYPE_H
      -- Looking for include files HAVE_WCTYPE_H - found
      -- Looking for include files HAVE_SYS_SOCKIO_H
      -- Looking for include files HAVE_SYS_SOCKIO_H - not found.
      -- Looking for include files HAVE_SYS_UTSNAME_H
      -- Looking for include files HAVE_SYS_UTSNAME_H - found
      -- Looking for include files HAVE_SYS_PTEM_H
      -- Looking for include files HAVE_SYS_PTEM_H - not found.
      -- Performing Test HAVE_WERROR_FLAG
      -- Performing Test HAVE_WERROR_FLAG - Success
      -- Performing Test HAVE_PTHREAD_ONCE_INIT
      -- Performing Test HAVE_PTHREAD_ONCE_INIT - Success
      -- Looking for access
      -- Looking for access - found
      -- Looking for aio_read
      -- Looking for aio_read - found
      -- Looking for alarm
      -- Looking for alarm - found
      -- Looking for backtrace
      -- Looking for backtrace - found
      -- Looking for backtrace_symbols
      -- Looking for backtrace_symbols - found
      -- Looking for backtrace_symbols_fd
      -- Looking for backtrace_symbols_fd - found
      -- Looking for printstack
      -- Looking for printstack - not found
      -- Looking for bfill
      -- Looking for bfill - not found
      -- Looking for bmove
      -- Looking for bmove - not found
      -- Looking for bsearch
      -- Looking for bsearch - found
      -- Looking for index
      -- Looking for index - found
      -- Looking for bzero
      -- Looking for bzero - found
      -- Looking for clock_gettime
      -- Looking for clock_gettime - found
      -- Looking for cuserid
      -- Looking for cuserid - found
      -- Looking for directio
      -- Looking for directio - not found
      -- Looking for _doprnt
      -- Looking for _doprnt - not found
      -- Looking for flockfile
      -- Looking for flockfile - found
      -- Looking for ftruncate
      -- Looking for ftruncate - found
      -- Looking for getline
      -- Looking for getline - found
      -- Looking for compress
      -- Looking for compress - not found
      -- Looking for crypt
      -- Looking for crypt - found
      -- Looking for dlerror
      -- Looking for dlerror - found
      -- Looking for dlopen
      -- Looking for dlopen - found
      -- Looking for fchmod
      -- Looking for fchmod - found
      -- Looking for fcntl
      -- Looking for fcntl - found
      -- Looking for fconvert
      -- Looking for fconvert - not found
      -- Looking for fdatasync
      -- Looking for fdatasync - found
      -- Looking for fdatasync
      -- Looking for fdatasync - found
      -- Looking for fesetround
      -- Looking for fesetround - found
      -- Looking for fedisableexcept
      -- Looking for fedisableexcept - found
      -- Looking for fpsetmask
      -- Looking for fpsetmask - not found
      -- Looking for fseeko
      -- Looking for fseeko - found
      -- Looking for fsync
      -- Looking for fsync - found
      -- Looking for getcwd
      -- Looking for getcwd - found
      -- Looking for gethostbyaddr_r
      -- Looking for gethostbyaddr_r - found
      -- Looking for gethrtime
      -- Looking for gethrtime - not found
      -- Looking for getnameinfo
      -- Looking for getnameinfo - found
      -- Looking for getpass
      -- Looking for getpass - found
      -- Looking for getpassphrase
      -- Looking for getpassphrase - not found
      -- Looking for getpwnam
      -- Looking for getpwnam - found
      -- Looking for getpwuid
      -- Looking for getpwuid - found
      -- Looking for getrlimit
      -- Looking for getrlimit - found
      -- Looking for getrusage
      -- Looking for getrusage - found
      -- Looking for getwd
      -- Looking for getwd - found
      -- Looking for gmtime_r
      -- Looking for gmtime_r - found
      -- Looking for initgroups
      -- Looking for initgroups - found
      -- Looking for issetugid
      -- Looking for issetugid - not found
      -- Looking for getuid
      -- Looking for getuid - found
      -- Looking for geteuid
      -- Looking for geteuid - found
      -- Looking for getgid
      -- Looking for getgid - found
      -- Looking for getegid
      -- Looking for getegid - found
      -- Looking for ldiv
      -- Looking for ldiv - found
      -- Looking for localtime_r
      -- Looking for localtime_r - found
      -- Looking for longjmp
      -- Looking for longjmp - found
      -- Looking for lstat
      -- Looking for lstat - found
      -- Looking for madvise
      -- Looking for madvise - found
      -- Looking for mallinfo
      -- Looking for mallinfo - found
      -- Looking for memcpy
      -- Looking for memcpy - found
      -- Looking for memmove
      -- Looking for memmove - found
      -- Looking for mkstemp
      -- Looking for mkstemp - found
      -- Looking for mlock
      -- Looking for mlock - found
      -- Looking for mlockall
      -- Looking for mlockall - found
      -- Looking for mmap
      -- Looking for mmap - found
      -- Looking for mmap64
      -- Looking for mmap64 - found
      -- Looking for perror
      -- Looking for perror - found
      -- Looking for poll
      -- Looking for poll - found
      -- Looking for port_create
      -- Looking for port_create - not found
      -- Looking for posix_fallocate
      -- Looking for posix_fallocate - found
      -- Looking for pread
      -- Looking for pread - found
      -- Looking for pthread_attr_create
      -- Looking for pthread_attr_create - not found
      -- Looking for pthread_attr_getstacksize
      -- Looking for pthread_attr_getstacksize - found
      -- Looking for pthread_attr_setscope
      -- Looking for pthread_attr_setscope - found
      -- Looking for pthread_attr_getguardsize
      -- Looking for pthread_attr_getguardsize - found
      -- Looking for pthread_attr_setstacksize
      -- Looking for pthread_attr_setstacksize - found
      -- Looking for pthread_condattr_create
      -- Looking for pthread_condattr_create - not found
      -- Looking for pthread_condattr_setclock
      -- Looking for pthread_condattr_setclock - found
      -- Looking for pthread_key_delete
      -- Looking for pthread_key_delete - found
      -- Looking for pthread_rwlock_rdlock
      -- Looking for pthread_rwlock_rdlock - found
      -- Looking for pthread_sigmask
      -- Looking for pthread_sigmask - found
      -- Looking for pthread_threadmask
      -- Looking for pthread_threadmask - not found
      -- Looking for pthread_yield_np
      -- Looking for pthread_yield_np - not found
      -- Looking for putenv
      -- Looking for putenv - found
      -- Looking for readdir_r
      -- Looking for readdir_r - found
      -- Looking for readlink
      -- Looking for readlink - found
      -- Looking for re_comp
      -- Looking for re_comp - found
      -- Looking for regcomp
      -- Looking for regcomp - found
      -- Looking for realpath
      -- Looking for realpath - found
      -- Looking for rename
      -- Looking for rename - found
      -- Looking for rwlock_init
      -- Looking for rwlock_init - not found
      -- Looking for sched_yield
      -- Looking for sched_yield - found
      -- Looking for setenv
      -- Looking for setenv - found
      -- Looking for setlocale
      -- Looking for setlocale - found
      -- Looking for setfd
      -- Looking for setfd - not found
      -- Looking for sigaction
      -- Looking for sigaction - found
      -- Looking for sigthreadmask
      -- Looking for sigthreadmask - not found
      -- Looking for sigwait
      -- Looking for sigwait - found
      -- Looking for sigaddset
      -- Looking for sigaddset - found
      -- Looking for sigemptyset
      -- Looking for sigemptyset - found
      -- Looking for sighold
      -- Looking for sighold - found
      -- Looking for sigset
      -- Looking for sigset - found
      -- Looking for sleep
      -- Looking for sleep - found
      -- Looking for snprintf
      -- Looking for snprintf - found
      -- Looking for stpcpy
      -- Looking for stpcpy - found
      -- Looking for strcoll
      -- Looking for strcoll - found
      -- Looking for strerror
      -- Looking for strerror - found
      -- Looking for strlcpy
      -- Looking for strlcpy - not found
      -- Looking for strnlen
      -- Looking for strnlen - found
      -- Looking for strlcat
      -- Looking for strlcat - not found
      -- Looking for strsignal
      -- Looking for strsignal - found
      -- Looking for fgetln
      -- Looking for fgetln - not found
      -- Looking for strpbrk
      -- Looking for strpbrk - found
      -- Looking for strstr
      -- Looking for strstr - found
      -- Looking for strtok_r
      -- Looking for strtok_r - found
      -- Looking for strtol
      -- Looking for strtol - found
      -- Looking for strtoll
      -- Looking for strtoll - found
      -- Looking for strtoul
      -- Looking for strtoul - found
      -- Looking for strtoull
      -- Looking for strtoull - found
      -- Looking for strcasecmp
      -- Looking for strcasecmp - found
      -- Looking for strncasecmp
      -- Looking for strncasecmp - found
      -- Looking for strdup
      -- Looking for strdup - found
      -- Looking for shmat
      -- Looking for shmat - found
      -- Looking for shmctl
      -- Looking for shmctl - found
      -- Looking for shmdt
      -- Looking for shmdt - found
      -- Looking for shmget
      -- Looking for shmget - found
      -- Looking for tell
      -- Looking for tell - not found
      -- Looking for tempnam
      -- Looking for tempnam - found
      -- Looking for thr_setconcurrency
      -- Looking for thr_setconcurrency - not found
      -- Looking for thr_yield
      -- Looking for thr_yield - not found
      -- Looking for vasprintf
      -- Looking for vasprintf - found
      -- Looking for vsnprintf
      -- Looking for vsnprintf - found
      -- Looking for vprintf
      -- Looking for vprintf - found
      -- Looking for valloc
      -- Looking for valloc - found
      -- Looking for memalign
      -- Looking for memalign - found
      -- Looking for chown
      -- Looking for chown - found
      -- Looking for nl_langinfo
      -- Looking for nl_langinfo - found
      -- Looking for include files HAVE_TIME_H
      -- Looking for include files HAVE_TIME_H - found
      -- Looking for include files HAVE_SYS_TIMES_H
      -- Looking for include files HAVE_SYS_TIMES_H - found
      -- Looking for include files HAVE_ASM_MSR_H
      -- Looking for include files HAVE_ASM_MSR_H - found
      -- Looking for include files HAVE_IA64INTRIN_H
      -- Looking for include files HAVE_IA64INTRIN_H - not found.
      -- Looking for times
      -- Looking for times - found
      -- Looking for gettimeofday
      -- Looking for gettimeofday - found
      -- Looking for read_real_time
      -- Looking for read_real_time - not found
      -- Looking for ftime
      -- Looking for ftime - found
      -- Looking for time
      -- Looking for time - found
      -- Looking for rdtscll
      -- Looking for rdtscll - not found
      -- Looking for madvise
      -- Looking for madvise - found
      -- Looking for tzname
      -- Looking for tzname - found
      -- Looking for lrand48
      -- Looking for lrand48 - found
      -- Looking for getpagesize
      -- Looking for getpagesize - found
      -- Looking for TIOCGWINSZ
      -- Looking for TIOCGWINSZ - found
      -- Looking for FIONREAD
      -- Looking for FIONREAD - found
      -- Looking for TIOCSTAT
      -- Looking for TIOCSTAT - not found.
      -- Looking for FIONREAD
      -- Looking for FIONREAD - not found.
      -- Looking for finite
      -- Looking for finite - found
      -- Looking for log2
      -- Looking for log2 - found
      -- Looking for isnan
      -- Looking for isnan - found
      -- Looking for rint
      -- Looking for rint - found
      -- Performing Test HAVE_ISINF
      -- Performing Test HAVE_ISINF - Success
      -- Check if the system is big endian
      -- Searching 16 bit integer
      -- Check size of unsigned short
      -- Check size of unsigned short - done
      -- Using unsigned short
      -- Check if the system is big endian - little endian
      -- Check size of sigset_t
      -- Check size of sigset_t - done
      -- Check size of mode_t
      -- Check size of mode_t - done
      -- Check size of in_addr_t
      -- Check size of in_addr_t - done
      -- Check size of char *
      -- Check size of char * - done
      -- Check size of long
      -- Check size of long - done
      -- Check size of size_t
      -- Check size of size_t - done
      -- Check size of char
      -- Check size of char - done
      -- Check size of short
      -- Check size of short - done
      -- Check size of int
      -- Check size of int - done
      -- Check size of long long
      -- Check size of long long - done
      -- Check size of off_t
      -- Check size of off_t - done
      -- Check size of uchar
      -- Check size of uchar - failed
      -- Check size of uint
      -- Check size of uint - done
      -- Check size of ulong
      -- Check size of ulong - done
      -- Check size of int8
      -- Check size of int8 - failed
      -- Check size of uint8
      -- Check size of uint8 - failed
      -- Check size of int16
      -- Check size of int16 - failed
      -- Check size of uint16
      -- Check size of uint16 - failed
      -- Check size of int32
      -- Check size of int32 - failed
      -- Check size of uint32
      -- Check size of uint32 - failed
      -- Check size of u_int32_t
      -- Check size of u_int32_t - done
      -- Check size of int64
      -- Check size of int64 - failed
      -- Check size of uint64
      -- Check size of uint64 - failed
      -- Check size of time_t
      -- Check size of time_t - done
      -- Check size of bool
      -- Check size of bool - failed
      -- Check size of socklen_t
      -- Check size of socklen_t - done
      -- Performing Test TIME_T_UNSIGNED
      -- Performing Test TIME_T_UNSIGNED - Failed
      -- Performing Test HAVE_GETADDRINFO
      -- Performing Test HAVE_GETADDRINFO - Success
      -- Performing Test HAVE_SELECT
      -- Performing Test HAVE_SELECT - Success
      -- Performing Test HAVE_TIMESPEC_TS_SEC
      -- Performing Test HAVE_TIMESPEC_TS_SEC - Failed
      -- Performing Test QSORT_TYPE_IS_VOID
      -- Performing Test QSORT_TYPE_IS_VOID - Success
      -- Performing Test HAVE_SOCKET_SIZE_T_AS_socklen_t
      -- Performing Test HAVE_SOCKET_SIZE_T_AS_socklen_t - Success
      -- Performing Test HAVE_PTHREAD_YIELD_ZERO_ARG
      -- Performing Test HAVE_PTHREAD_YIELD_ZERO_ARG - Success
      -- Checking stack direction : -1
      -- Performing Test SIGNAL_RETURN_TYPE_IS_VOID
      -- Performing Test SIGNAL_RETURN_TYPE_IS_VOID - Success
      -- Looking for include files TIME_WITH_SYS_TIME
      -- Looking for include files TIME_WITH_SYS_TIME - found
      -- Looking for O_NONBLOCK
      -- Looking for O_NONBLOCK - found
      -- Performing Test C_HAS_inline
      -- Performing Test C_HAS_inline - Success
      -- Performing Test HAVE_PAUSE_INSTRUCTION
      -- Performing Test HAVE_PAUSE_INSTRUCTION - Success
      -- Looking for tcgetattr
      -- Looking for tcgetattr - found
      -- Performing Test HAVE_POSIX_SIGNALS
      -- Performing Test HAVE_POSIX_SIGNALS - Success
      -- Performing Test HAVE_ABI_CXA_DEMANGLE
      -- Performing Test HAVE_ABI_CXA_DEMANGLE - Success
      -- Performing Test HAVE_BSS_START
      -- Performing Test HAVE_BSS_START - Success
      -- Performing Test HAVE_WEAK_SYMBOL
      -- Performing Test HAVE_WEAK_SYMBOL - Success
      -- Performing Test HAVE_CXX_NEW
      -- Performing Test HAVE_CXX_NEW - Success
      -- Performing Test HAVE_SOLARIS_STYLE_GETHOST
      -- Performing Test HAVE_SOLARIS_STYLE_GETHOST - Failed
      -- Performing Test HAVE_SOCKET_TIMEOUT
      -- Performing Test HAVE_SOCKET_TIMEOUT - Success
      -- Performing Test HAVE_GCC_ATOMIC_BUILTINS
      -- Performing Test HAVE_GCC_ATOMIC_BUILTINS - Success
      -- Looking for include files HAVE_VALGRIND
      -- Looking for include files HAVE_VALGRIND - not found.
      -- Looking for netinet/in6.h
      -- Looking for netinet/in6.h - not found
      -- Check size of struct sockaddr_in6
      -- Check size of struct sockaddr_in6 - done
      -- Check size of struct in6_addr
      -- Check size of struct in6_addr - done
      -- Performing Test HAVE_SOCKADDR_STORAGE_SS_FAMILY
      -- Performing Test HAVE_SOCKADDR_STORAGE_SS_FAMILY - Success
      -- Performing Test HAVE_SOCKADDR_IN_SIN_LEN
      -- Performing Test HAVE_SOCKADDR_IN_SIN_LEN - Failed
      -- Performing Test HAVE_SOCKADDR_IN6_SIN6_LEN
      -- Performing Test HAVE_SOCKADDR_IN6_SIN6_LEN - Failed
      -- Performing Test STRUCT_DIRENT_HAS_D_INO
      -- Performing Test STRUCT_DIRENT_HAS_D_INO - Success
      -- Performing Test STRUCT_DIRENT_HAS_D_NAMLEN
      -- Performing Test STRUCT_DIRENT_HAS_D_NAMLEN - Failed
      -- Looking for ucontext.h
      -- Looking for ucontext.h - found
      -- Looking for crc32
      -- Looking for crc32 - found
      -- Looking for compressBound
      -- Looking for compressBound - found
      -- Looking for deflateBound
      -- Looking for deflateBound - found
      -- Found OpenSSL: /usr/lib/x86_64-linux-gnu/libssl.so;/usr/lib/x86_64-linux-gnu/libcrypto.so (found version "1..1")
      -- Looking for SHA512_DIGEST_LENGTH
      -- Looking for SHA512_DIGEST_LENGTH - found
      -- Check size of mbstate_t
      -- Check size of mbstate_t - done
      -- Performing Test HAVE_LANGINFO_CODESET
      -- Performing Test HAVE_LANGINFO_CODESET - Success
      -- Looking for mbrlen
      -- Looking for mbrlen - found
      -- Looking for mbscmp
      -- Looking for mbscmp - not found
      -- Looking for mbsrtowcs
      -- Looking for mbsrtowcs - found
      -- Looking for wcrtomb
      -- Looking for wcrtomb - found
      -- Looking for mbrtowc
      -- Looking for mbrtowc - found
      -- Looking for wcscoll
      -- Looking for wcscoll - found
      -- Looking for wcsdup
      -- Looking for wcsdup - found
      -- Looking for wcwidth
      -- Looking for wcwidth - found
      -- Looking for wctype
      -- Looking for wctype - found
      -- Looking for iswlower
      -- Looking for iswlower - found
      -- Looking for iswupper
      -- Looking for iswupper - found
      -- Looking for towlower
      -- Looking for towlower - found
      -- Looking for towupper
      -- Looking for towupper - found
      -- Looking for iswctype
      -- Looking for iswctype - found
      -- Check size of wchar_t
      -- Check size of wchar_t - done
      -- Check size of wctype_t
      -- Check size of wctype_t - done
      -- Check size of wint_t
      -- Check size of wint_t - done
      -- Found Curses: /usr/lib/x86_64-linux-gnu/libcurses.so 
      -- Looking for tputs in /usr/lib/x86_64-linux-gnu/libcurses.so
      -- Looking for tputs in /usr/lib/x86_64-linux-gnu/libcurses.so - found
      -- Looking for setupterm in /usr/lib/x86_64-linux-gnu/libcurses.so
      -- Looking for setupterm in /usr/lib/x86_64-linux-gnu/libcurses.so - found
      -- Looking for vidattr in /usr/lib/x86_64-linux-gnu/libcurses.so
      -- Looking for vidattr in /usr/lib/x86_64-linux-gnu/libcurses.so - found
      -- Looking for malloc_stats_print in jemalloc
      -- Looking for malloc_stats_print in jemalloc - not found
      -- Performing Test HAVE_VISIBILITY_HIDDEN
      -- Performing Test HAVE_VISIBILITY_HIDDEN - Success
      -- Boost version: 1.46.1
      -- Performing Test BOOST_OK
      -- Performing Test BOOST_OK - Success
      -- Performing Test HAVE_IB_GCC_ATOMIC_BUILTINS
      -- Performing Test HAVE_IB_GCC_ATOMIC_BUILTINS - Success
      -- Performing Test HAVE_IB_ATOMIC_PTHREAD_T_GCC
      -- Performing Test HAVE_IB_ATOMIC_PTHREAD_T_GCC - Success
      -- Check size of pthread_t
      -- Check size of pthread_t - done
      -- Performing Test HAVE_IB_GCC_ATOMIC_BUILTINS_64
      -- Performing Test HAVE_IB_GCC_ATOMIC_BUILTINS_64 - Success
      -- Looking for include files HAVE_NETDB_H
      -- Looking for include files HAVE_NETDB_H - found
      -- Looking for include files HAVE_PAM_APPL_H
      -- Looking for include files HAVE_PAM_APPL_H - found
      -- Looking for strndup
      -- Looking for strndup - found
      -- Performing Test HAVE_PEERCRED
      -- Performing Test HAVE_PEERCRED - Success
      -- Looking for event.h
      -- Looking for event.h - found
      -- Configuring done
      -- Generating done
      -- Build files have been written to: /home/openquery/mariadb-5.5-5.5.38+maria/builddir
      touch configure-stamp
      RULES.build-stamp
      dh_testdir
      cd builddir && /usr/bin/make -j2 
      ...
      ...
      ...
      [ 98%] Building CXX object sql/CMakeFiles/sql.dir/opt_table_elimination.cc.o                                                                                                            
      [ 98%] Building CXX object sql/CMakeFiles/sql.dir/sql_expression_cache.cc.o                                                                                                             
      [ 98%] Building CXX object sql/CMakeFiles/sql.dir/gcalc_slicescan.cc.o                                                                                                                  
      [ 98%] Building CXX object sql/CMakeFiles/sql.dir/gcalc_tools.cc.o                                                                                                                      
      [100%] Building CXX object sql/CMakeFiles/sql.dir/threadpool_common.cc.o                                                                                                                
      [100%] Building C object sql/CMakeFiles/sql.dir/__/sql-common/mysql_async.c.o                                                                                                           
      [100%] Building CXX object sql/CMakeFiles/sql.dir/sql_builtin.cc.o                                                                                                                      
      [100%] Building CXX object sql/CMakeFiles/sql.dir/sql_yacc.cc.o                                                                                                                         
      [100%] Building CXX object sql/CMakeFiles/sql.dir/threadpool_unix.cc.o                                                                                                                  
      Linking CXX static library libsql.a
      make[3]: Leaving directory `/home/openquery/mariadb-5.5-5.5.38+maria/builddir'
      [100%] Built target sql
      make[3]: Entering directory `/home/openquery/mariadb-5.5-5.5.38+maria/builddir'
      Scanning dependencies of target mysqld
      make[3]: Entering directory `/home/openquery/mariadb-5.5-5.5.38+maria/builddir'
      Scanning dependencies of target explain_filename-t
      make[3]: Leaving directory `/home/openquery/mariadb-5.5-5.5.38+maria/builddir'
      make[3]: Entering directory `/home/openquery/mariadb-5.5-5.5.38+maria/builddir'
      [100%] Building CXX object sql/CMakeFiles/mysqld.dir/main.cc.o
      Linking CXX executable mysqld
      make[3]: Leaving directory `/home/openquery/mariadb-5.5-5.5.38+maria/builddir'
      make[3]: Entering directory `/home/openquery/mariadb-5.5-5.5.38+maria/builddir'
      [100%] Building CXX object unittest/sql/CMakeFiles/explain_filename-t.dir/explain_filename-t.cc.o
      Linking CXX executable explain_filename-t
      make[3]: Leaving directory `/home/openquery/mariadb-5.5-5.5.38+maria/builddir'
      make[3]: Leaving directory `/home/openquery/mariadb-5.5-5.5.38+maria/builddir'
      [100%] [100%] Built target mysqld
      Built target explain_filename-t
      make[3]: Entering directory `/home/openquery/mariadb-5.5-5.5.38+maria/builddir'
      Scanning dependencies of target udf_example
      make[3]: Leaving directory `/home/openquery/mariadb-5.5-5.5.38+maria/builddir'
      make[3]: Entering directory `/home/openquery/mariadb-5.5-5.5.38+maria/builddir'
      [100%] Building C object sql/CMakeFiles/udf_example.dir/udf_example.c.o
      Linking C shared module udf_example.so
      make[3]: Leaving directory `/home/openquery/mariadb-5.5-5.5.38+maria/builddir'
      [100%] Built target udf_example
      make[2]: Leaving directory `/home/openquery/mariadb-5.5-5.5.38+maria/builddir'
      make[1]: Leaving directory `/home/openquery/mariadb-5.5-5.5.38+maria/builddir'
      # Don't know why the following is necessary...
      cp unittest/unit.pl builddir/unittest/
      cp -r mysql-test/* builddir/mysql-test/
      cp -r sql/share/* builddir/sql/share/
      cp -r scripts/*sql builddir/scripts/
      if [ ! -f testsuite-stamp ] ; then \
                cd builddir && /usr/bin/make test-force || exit 1 ; \
              fi
      make[1]: Entering directory `/home/openquery/mariadb-5.5-5.5.38+maria/builddir'
      make[2]: Entering directory `/home/openquery/mariadb-5.5-5.5.38+maria/builddir'
      make[3]: Entering directory `/home/openquery/mariadb-5.5-5.5.38+maria/builddir'
      make[4]: Entering directory `/home/openquery/mariadb-5.5-5.5.38+maria/builddir'
      Scanning dependencies of target test-force
      make[4]: Leaving directory `/home/openquery/mariadb-5.5-5.5.38+maria/builddir'
      make[4]: Entering directory `/home/openquery/mariadb-5.5-5.5.38+maria/builddir'
      Running tests
      OS=Linux
      Logging: ./mysql-test-run.pl  --force
      vardir: /home/openquery/mariadb-5.5-5.5.38+maria/builddir/mysql-test/var
      Removing old var directory...
      Creating var directory '/home/openquery/mariadb-5.5-5.5.38+maria/builddir/mysql-test/var'...
      Checking supported features...
      ** ERROR: Could not find '*' in 
       at lib/mtr_cases.pm line 339
      make[4]: *** [mysql-test/CMakeFiles/test-force] Error 2
      make[4]: Leaving directory `/home/openquery/mariadb-5.5-5.5.38+maria/builddir'
      make[3]: *** [mysql-test/CMakeFiles/test-force.dir/all] Error 2
      make[3]: Leaving directory `/home/openquery/mariadb-5.5-5.5.38+maria/builddir'
      make[2]: *** [mysql-test/CMakeFiles/test-force.dir/rule] Error 2
      make[2]: Leaving directory `/home/openquery/mariadb-5.5-5.5.38+maria/builddir'
      make[1]: *** [test-force] Error 2
      make[1]: Leaving directory `/home/openquery/mariadb-5.5-5.5.38+maria/builddir'
      make: *** [build-stamp] Error 1
      dpkg-buildpackage: error: debian/rules build gave error exit status 2

        Attachments

          Issue Links

            Activity

              People

              Assignee:
              otto Otto Kekäläinen
              Reporter:
              danblack Daniel Black
              Votes:
              0 Vote for this issue
              Watchers:
              5 Start watching this issue

                Dates

                Created:
                Updated:
                Resolved:

                  Git Integration