Uploaded image for project: 'MariaDB Server'
  1. MariaDB Server
  2. MDEV-24886

main.sp_trans_log fails in buildbot with timeout

    XMLWordPrintable

    Details

    • Type: Bug
    • Status: Open (View Workflow)
    • Priority: Major
    • Resolution: Unresolved
    • Affects Version/s: 10.5
    • Fix Version/s: 10.5
    • Component/s: Tests
    • Labels:
      None

      Description

      http://buildbot.askmonty.org/buildbot/builders/winx64-debug/builds/22835

      10.5 7c052cdf0

      main.sp_trans_log 'innodb'               w3 [ fail ]  timeout after 900 seconds
              Test ended at 2021-01-17 12:55:32
       
      Test case timeout after 900 seconds
       
      == D:/winx64-debug/build/mysql-test/var/3/log/sp_trans_log.log == 
      drop function if exists bug23333|
      drop table if exists t1,t2|
      CREATE TABLE t1 (a int  NOT NULL auto_increment primary key) ENGINE=MyISAM|
      CREATE TABLE t2 (a int  NOT NULL auto_increment, b int, PRIMARY KEY (a)) ENGINE=InnoDB|
      insert into t2 values (1,1)|
      create function bug23333() 
      RETURNS int(11)
      DETERMINISTIC
      begin
      insert into t1 values (null);
      select count(*) from t1 into @a;
      return @a;
      end|
      Warnings:
      Warning	1287	'<select expression> INTO <destination>;' is deprecated and will be removed in a future release. Please use 'SELECT <select list> INTO <destination> FROM...' instead
      reset master;
       
       == D:/winx64-debug/build/mysql-test/var/3/tmp/analyze-timeout-mysqld.1.err ==
      SHOW PROCESSLIST;
      Id	User	Host	db	Command	Time	State	Info	Progress
      5	root	localhost:35542	test	Query	940	starting	reset master	0.000
      6	root	localhost:38319	NULL	Query	0	starting	SHOW PROCESSLIST	0.000
       
      mysqltest failed but provided no output
      The result from queries just before the failure was:
      < snip >
      drop function if exists bug23333|
      drop table if exists t1,t2|
      CREATE TABLE t1 (a int  NOT NULL auto_increment primary key) ENGINE=MyISAM|
      CREATE TABLE t2 (a int  NOT NULL auto_increment, b int, PRIMARY KEY (a)) ENGINE=InnoDB|
      insert into t2 values (1,1)|
      create function bug23333() 
      RETURNS int(11)
      DETERMINISTIC
      begin
      insert into t1 values (null);
      select count(*) from t1 into @a;
      return @a;
      end|
      Warnings:
      Warning	1287	'<select expression> INTO <destination>;' is deprecated and will be removed in a future release. Please use 'SELECT <select list> INTO <destination> FROM...' instead
      reset master;
       
       
       - found 'mariadbd.dmp', moving it to 'D:/winx64-debug/build/mysql-test/var/3/log/main.sp_trans_log-innodb'
       - found 'mysqltest.dmp', moving it to 'D:/winx64-debug/build/mysql-test/var/3/log/main.sp_trans_log-innodb'
       - found 'mariadbd.dmp' (0/5)
       
      Trying 'cdb' to get a backtrace
      Output from cdb follows. Faulting thread is printed twice,with and without function parameters
      Search for STACK_TEXT to see the stack trace of 
      the faulting thread. Callstacks of other threads are printed after it.
       
      Microsoft (R) Windows Debugger Version 10.0.16299.15 AMD64
      Copyright (c) Microsoft Corporation. All rights reserved.
       
       
      Loading Dump File [D:\winx64-debug\build\mysql-test\var\3\log\main.sp_trans_log-innodb\mariadbd.dmp]
      User Mini Dump File: Only registers, stack and portions of memory are available
       
       
      Response                         Time (ms)     Location
      OK                                             D:\winx64-debug\build\sql\Debug
      OK                                             C:\Windows\System32
      OK                                             .
       
      Response                         Time (ms)     Location
      OK                                             D:\winx64-debug\build\sql\Debug
      OK                                             C:\Windows\System32
      OK                                             .
      Deferred                                       cache*C:\cdb_symbols
      Symbol search path is: D:\winx64-debug\build\sql\Debug;C:\Windows\System32;.;cache*C:\cdb_symbols
      Executable search path is: D:\winx64-debug\build\sql\Debug;C:\Windows\System32;.
      Windows 10 Version 17763 MP (4 procs) Free x64
      Product: Server, suite: TerminalServer DataCenter SingleUserTS
      17763.1.amd64fre.rs5_release.180914-1434
      Machine Name:
      Debug session time: Sun Jan 17 12:55:11.000 2021 (UTC + 0:00)
      System Uptime: not available
      Process Uptime: 0 days 0:15:24.000
      .............................
      ntdll!NtWaitForMultipleObjects:
                   ret
      0:000> cdb: Reading initial command '!sym prompts off; !analyze -v; .ecxr; !for_each_frame dv /t;!uniqstack -p;q'
      quiet mode - symbol prompts off
       
      GetUrlPageData2 (WinHttp) failed: 12002.
       
      DUMP_CLASS: 2
       
      DUMP_QUALIFIER: 400
       
      FAULTING_IP: 
      +0
      ??              ???
       
      EXCEPTION_RECORD:  (.exr -1)
      ExceptionAddress: 0000000000000000
         ExceptionCode: 80000003 (Break instruction exception)
        ExceptionFlags: 00000000
      NumberParameters: 0
       
      FAULTING_THREAD:  00000f24
       
      BUGCHECK_STR:  BREAKPOINT
       
      DEFAULT_BUCKET_ID:  BREAKPOINT
       
      PROCESS_NAME:  mariadbd.exe
       
      ERROR_CODE: (NTSTATUS) 0x80000003 - {EXCEPTION}  Breakpoint  A breakpoint has been reached.
       
      EXCEPTION_CODE: (HRESULT) 0x80000003 (2147483651) - One or more arguments are invalid
       
      EXCEPTION_CODE_STR:  80000003
       
      WATSON_BKT_PROCSTAMP:  60042f69
       
      WATSON_BKT_PROCVER:  10.5.9.0
       
      WATSON_BKT_MODULE:  unknown
       
      WATSON_BKT_MODVER:  0.0.0.0
       
      WATSON_BKT_MODOFFSET:  0
       
      WATSON_BKT_MODSTAMP:  bbbbbbb4
       
      BUILD_VERSION_STRING:  10.0.17763.475 (WinBuild.160101.0800)
       
      MODLIST_WITH_TSCHKSUM_HASH:  aabe7cd8bb37aca5fe13d65299eb0c4f76d63ce0
       
      MODLIST_SHA1_HASH:  228fbfad66272b22d4527ae291e5f9e8aa05a8c7
       
      DUMP_FLAGS:  0
       
      DUMP_TYPE:  2
       
      ANALYSIS_SESSION_HOST:  MARIADB-02
       
      ANALYSIS_SESSION_TIME:  01-17-2021 12:55:33.0661
       
      ANALYSIS_VERSION: 10.0.16299.15 amd64fre
       
      THREAD_ATTRIBUTES: 
      PROBLEM_CLASSES: 
       
          ID:     [0n309]
          Type:   [@APPLICATION_FAULT_STRING]
          Class:  Primary
          Scope:  DEFAULT_BUCKET_ID (Failure Bucket ID prefix)
                  BUCKET_ID
          Name:   Omit
          Data:   Add
                  String: [BREAKPOINT]
          PID:    [Unspecified]
          TID:    [Unspecified]
          Frame:  [0]
       
      PRIMARY_PROBLEM_CLASS:  BREAKPOINT
       
      LAST_CONTROL_TRANSFER:  from 00007ffc24b3cc2e to 00007ffc280402b4
       
      STACK_TEXT:  
      ntdll!NtWaitForMultipleObjects
      KERNELBASE!WaitForMultipleObjectsEx
      KERNELBASE!WaitForMultipleObjects
      server!handle_connections_win
      server!win_main
      server!mysql_service
      server!mysqld_main
      mariadbd!main
      mariadbd!__scrt_common_main_seh
      kernel32!BaseThreadInitThunk
      ntdll!RtlUserThreadStart
       
       
      STACK_COMMAND:  ~0s; .ecxr ; kb
       
      THREAD_SHA1_HASH_MOD_FUNC:  94457f3482851549178834b1146cf48411118d40
       
      THREAD_SHA1_HASH_MOD_FUNC_OFFSET:  737e27c42b0342415074a68178f3eed2f500ed4a
       
      THREAD_SHA1_HASH_MOD:  9edafeac4e9c8fc20846c41fe9847618c25331dd
       
      FOLLOWUP_IP: 
      server!handle_connections_win+1f7 [D:\winx64-debug\build\src\sql\handle_connections_win.cc @ 594]
             mov     dword ptr [rsp+30h],eax
       
      FAULT_INSTR_CODE:  30244489
       
      FAULTING_SOURCE_LINE:  D:\winx64-debug\build\src\sql\handle_connections_win.cc
       
      FAULTING_SOURCE_FILE:  D:\winx64-debug\build\src\sql\handle_connections_win.cc
       
      FAULTING_SOURCE_LINE_NUMBER:  594
       
      FAULTING_SOURCE_CODE:  
         590:   }
         591: 
         592:   for (;;)
         593:   {
      >  594:     DWORD idx = WaitForMultipleObjects(n_waits ,wait_events, FALSE, INFINITE);
         595:     DBUG_ASSERT((int)idx >= 0 && (int)idx < n_waits);
         596: 
         597:     if (idx == SHUTDOWN_IDX)
         598:       break;
         599: 
       
       
      SYMBOL_STACK_INDEX:  3
       
      SYMBOL_NAME:  server!handle_connections_win+1f7
       
      FOLLOWUP_NAME:  MachineOwner
       
      MODULE_NAME: server
       
      IMAGE_NAME:  server.dll
       
      DEBUG_FLR_IMAGE_TIMESTAMP:  60042f5f
       
      BUCKET_ID:  BREAKPOINT_server!handle_connections_win+1f7
       
      FAILURE_EXCEPTION_CODE:  80000003
       
      FAILURE_IMAGE_NAME:  server.dll
       
      BUCKET_ID_IMAGE_STR:  server.dll
       
      FAILURE_MODULE_NAME:  server
       
      BUCKET_ID_MODULE_STR:  server
       
      FAILURE_FUNCTION_NAME:  handle_connections_win
       
      BUCKET_ID_FUNCTION_STR:  handle_connections_win
       
      BUCKET_ID_OFFSET:  1f7
       
      BUCKET_ID_MODTIMEDATESTAMP:  60042f5f
       
      BUCKET_ID_MODCHECKSUM:  0
       
      BUCKET_ID_MODVER_STR:  10.5.9.0
       
      BUCKET_ID_PREFIX_STR:  BREAKPOINT_
       
      FAILURE_PROBLEM_CLASS:  BREAKPOINT
       
      FAILURE_SYMBOL_NAME:  server.dll!handle_connections_win
       
      FAILURE_BUCKET_ID:  BREAKPOINT_80000003_server.dll!handle_connections_win
       
      WATSON_STAGEONE_URL:  http://watson.microsoft.com/StageOne/mariadbd.exe/10.5.9.0/60042f69/unknown/0.0.0.0/bbbbbbb4/80000003/00000000.htm?Retriage=1
       
      TARGET_TIME:  2021-01-17T12:55:11.000Z
       
      OSBUILD:  17763
       
      OSSERVICEPACK:  475
       
      SERVICEPACK_NUMBER: 0
       
      OS_REVISION: 0
       
      SUITE_MASK:  400
       
      PRODUCT_TYPE:  3
       
      OSPLATFORM_TYPE:  x64
       
      OSNAME:  Windows 10
       
      OSEDITION:  Windows 10 Server TerminalServer DataCenter SingleUserTS
       
      OS_LOCALE:  
       
      USER_LCID:  0
       
      OSBUILD_TIMESTAMP:  1989-09-10 06:58:46
       
      BUILDDATESTAMP_STR:  160101.0800
       
      BUILDLAB_STR:  WinBuild
       
      BUILDOSVER_STR:  10.0.17763.475
       
      ANALYSIS_SESSION_ELAPSED_TIME:  5f38
       
      ANALYSIS_SOURCE:  UM
       
      FAILURE_ID_HASH_STRING:  um:breakpoint_80000003_server.dll!handle_connections_win
       
      FAILURE_ID_HASH:  {7f6baf5c-23b5-de2b-3c09-c3758a83051e}
       
      Followup:     MachineOwner
      ---------
       
      Minidump doesn't have an exception context
      Unable to get exception context, HRESULT 0x80004002
      _ _ _ _ _ _ _ _ _ _ _ _ _ _ _ _
      ntdll!NtWaitForMultipleObjects
      Unable to enumerate locals, Win32 error 0n87
      Private symbols (symbols.pri) are required for locals.
      Type ".hh dbgerr005" for details.
      _ _ _ _ _ _ _ _ _ _ _ _ _ _ _ _
      KERNELBASE!WaitForMultipleObjectsEx
      _ _ _ _ _ _ _ _ _ _ _ _ _ _ _ _
      KERNELBASE!WaitForMultipleObjects
      Unable to enumerate locals, Win32 error 0n87
      Private symbols (symbols.pri) are required for locals.
      Type ".hh dbgerr005" for details.
      _ _ _ _ _ _ _ _ _ _ _ _ _ _ _ _
      server!handle_connections_win [D:\winx64-debug\build\src\sql\handle_connections_win.cc @ 594]
      unsigned long idx = 0xcccccccc
      int n_waits = 0n1
      _ _ _ _ _ _ _ _ _ _ _ _ _ _ _ _
      server!win_main [D:\winx64-debug\build\src\sql\mysqld.cc @ 5678]
      int argc = 0n165
      char ** argv = 0x00000171`3e217820
      char * user = 0xcccccccc`cccccccc "--- memory read error at address 0xcccccccc`cccccccc ---"
      int ho_error = 0n0
      unsigned int64 new_thread_stack_size = 0x49000
      _ _ _ _ _ _ _ _ _ _ _ _ _ _ _ _
      server!mysql_service [D:\winx64-debug\build\src\sql\mysqld.cc @ 5745]
      void * p = 0x00000000`00000000
      _ _ _ _ _ _ _ _ _ _ _ _ _ _ _ _
      server!mysqld_main [D:\winx64-debug\build\src\sql\mysqld.cc @ 5963]
      int argc = 0n25
      char ** argv = 0x00000171`3e207a50
      char [512] file_path = char [512] "D:\winx64-debug\build\sql\Debug\mariadbd.exe"
      _ _ _ _ _ _ _ _ _ _ _ _ _ _ _ _
      mariadbd!main [D:\winx64-debug\build\src\sql\main.cc @ 26]
      int argc = 0n25
      char ** argv = 0x00000171`3e207a50
      _ _ _ _ _ _ _ _ _ _ _ _ _ _ _ _
      (Inline Function) --------`-------- mariadbd!invoke_main [d:\agent\_work\63\s\src\vctools\crt\vcstartup\src\startup\exe_common.inl @ 78]
      _ _ _ _ _ _ _ _ _ _ _ _ _ _ _ _
      mariadbd!__scrt_common_main_seh [d:\agent\_work\63\s\src\vctools\crt\vcstartup\src\startup\exe_common.inl @ 288]
      bool has_cctor = false
      int main_result = <value unavailable>
      <function> ** tls_init_callback = <value unavailable>
      bool is_nested = <value unavailable>
      <function> ** tls_dtor_callback = <value unavailable>
      int main_result = <value unavailable>
      __scrt_native_startup_state __scrt_current_native_startup_state = <value unavailable>
      _ _ _ _ _ _ _ _ _ _ _ _ _ _ _ _
      kernel32!BaseThreadInitThunk
      Unable to enumerate locals, Win32 error 0n87
      Private symbols (symbols.pri) are required for locals.
      Type ".hh dbgerr005" for details.
      _ _ _ _ _ _ _ _ _ _ _ _ _ _ _ _
      ntdll!RtlUserThreadStart
      Unable to enumerate locals, Win32 error 0n87
      Private symbols (symbols.pri) are required for locals.
      Type ".hh dbgerr005" for details.
      _ _ _ _ _ _ _ _ _ _ _ _ _ _ _ _
      ntdll!NtWaitForMultipleObjects
      Processing 8 threads, please wait
       
      .  0  Id: 13ec.f24 Suspend: 0 Teb: 00000010`4e070000 Unfrozen
            Priority: 0  Priority class: 32
       
      ntdll!NtWaitForMultipleObjects
      KERNELBASE!WaitForMultipleObjectsEx
      KERNELBASE!WaitForMultipleObjects
      server!handle_connections_win(void) [D:\winx64-debug\build\src\sql\handle_connections_win.cc @ 594]
      server!win_main(int argc = 0n165, char ** argv = 0x00000171`3e217820) [D:\winx64-debug\build\src\sql\mysqld.cc @ 5678]
      server!mysql_service(void * p = 0x00000000`00000000) [D:\winx64-debug\build\src\sql\mysqld.cc @ 5745]
      server!mysqld_main(int argc = 0n25, char ** argv = 0x00000171`3e207a50) [D:\winx64-debug\build\src\sql\mysqld.cc @ 5963]
      mariadbd!main(int argc = 0n25, char ** argv = 0x00000171`3e207a50) [D:\winx64-debug\build\src\sql\main.cc @ 26]
      (Inline Function) --------`-------- mariadbd!invoke_main [d:\agent\_work\63\s\src\vctools\crt\vcstartup\src\startup\exe_common.inl @ 78]
      mariadbd!__scrt_common_main_seh(void) [d:\agent\_work\63\s\src\vctools\crt\vcstartup\src\startup\exe_common.inl @ 288]
      kernel32!BaseThreadInitThunk
      ntdll!RtlUserThreadStart
       
      .  1  Id: 13ec.128 Suspend: 0 Teb: 00000010`4e076000 Unfrozen
            Priority: 0  Priority class: 32
       
      ntdll!NtWaitForAlertByThreadId
      ntdll!RtlSleepConditionVariableCS
      KERNELBASE!SleepConditionVariableCS
      server!pthread_cond_timedwait(struct _RTL_CONDITION_VARIABLE * cond = 0x00007ffb`df8417a0, struct _RTL_CRITICAL_SECTION * mutex = 0x00007ffb`df841770, struct timespec * abstime = 0x00000010`4e4ff6d8) [D:\winx64-debug\build\src\mysys\my_wincond.c @ 82]
      server!inline_mysql_cond_timedwait(struct st_mysql_cond * that = 0x00007ffb`df8417a0, struct st_mysql_mutex * mutex = 0x00007ffb`df841770, struct timespec * abstime = 0x00000010`4e4ff6d8, char * src_file = 0x00007ffb`df4fb0b8 "--- memory read error at address 0x00007ffb`df4fb0b8 ---", unsigned int src_line = 0x141) [D:\winx64-debug\build\src\include\mysql\psi\mysql_thread.h @ 1259]
      server!timer_handler(void * arg = 0x00000000`00000000) [D:\winx64-debug\build\src\mysys\thr_timer.c @ 322]
      server!pfs_spawn_thread(void * arg = 0x00000171`3f2fcb18) [D:\winx64-debug\build\src\storage\perfschema\pfs.cc @ 2203]
      server!pthread_start(void * p = 0x00000171`3e2059c0) [D:\winx64-debug\build\src\mysys\my_winthread.c @ 61]
      ucrtbase!o_exp
      kernel32!BaseThreadInitThunk
      ntdll!RtlUserThreadStart
       
      .  2  Id: 13ec.83c Suspend: 0 Teb: 00000010`4e078000 Unfrozen
            Priority: 0  Priority class: 32
       
      ntdll!NtWaitForAlertByThreadId
      ntdll!RtlSleepConditionVariableCS
      KERNELBASE!SleepConditionVariableCS
      server!pthread_cond_timedwait(struct _RTL_CONDITION_VARIABLE * cond = 0x00007ffb`e01e2ac0, struct _RTL_CRITICAL_SECTION * mutex = 0x00007ffb`e01e2a90, struct timespec * abstime = 0x00000010`4e5ff9a8) [D:\winx64-debug\build\src\mysys\my_wincond.c @ 82]
      server!inline_mysql_cond_timedwait(struct st_mysql_cond * that = 0x00007ffb`e01e2ac0, struct st_mysql_mutex * mutex = 0x00007ffb`e01e2a90, struct timespec * abstime = 0x00000010`4e5ff9a8, char * src_file = 0x00007ffb`df79a7e0 "--- memory read error at address 0x00007ffb`df79a7e0 ---", unsigned int src_line = 0x74) [D:\winx64-debug\build\src\include\mysql\psi\mysql_thread.h @ 1259]
      server!my_service_thread_sleep(struct st_ma_service_thread_control * control = 0x00007ffb`df757ff8, unsigned int64 sleep_time = 0x00000006`fc23ac00) [D:\winx64-debug\build\src\storage\maria\ma_servicethread.c @ 119]
      server!ma_checkpoint_background(void * arg = 0x00000000`0000001e) [D:\winx64-debug\build\src\storage\maria\ma_checkpoint.c @ 707]
      server!pfs_spawn_thread(void * arg = 0x00000171`41ec4f38) [D:\winx64-debug\build\src\storage\perfschema\pfs.cc @ 2203]
      server!pthread_start(void * p = 0x00000171`3e205bc0) [D:\winx64-debug\build\src\mysys\my_winthread.c @ 61]
      ucrtbase!o_exp
      kernel32!BaseThreadInitThunk
      ntdll!RtlUserThreadStart
       
      .  3  Id: 13ec.1918 Suspend: 0 Teb: 00000010`4e07c000 Unfrozen
            Priority: 0  Priority class: 32
       
      ntdll!NtWaitForAlertByThreadId
      ntdll!RtlSleepConditionVariableCS
      KERNELBASE!SleepConditionVariableCS
      server!pthread_cond_timedwait(struct _RTL_CONDITION_VARIABLE * cond = 0x00007ffb`e027a6f8, struct _RTL_CRITICAL_SECTION * mutex = 0x00007ffb`e027a680, struct timespec * abstime = 0x00000000`00000000) [D:\winx64-debug\build\src\mysys\my_wincond.c @ 82]
      server!pthread_cond_wait(struct _RTL_CONDITION_VARIABLE * cond = 0x00007ffb`e027a6f8, struct _RTL_CRITICAL_SECTION * mutex = 0x00007ffb`e027a680) [D:\winx64-debug\build\src\mysys\my_wincond.c @ 91]
      server!inline_mysql_cond_wait(struct st_mysql_cond * that = 0x00007ffb`e027a6f8, struct st_mysql_mutex * mutex = 0x00007ffb`e027a680, char * src_file = 0x00007ffb`de2da1f8 "D:\winx64-debug\build\src\storage\innobase\buf\buf0flu.cc", unsigned int src_line = 0x832) [D:\winx64-debug\build\src\include\mysql\psi\mysql_thread.h @ 1233]
      server!buf_flush_page_cleaner(void * __formal = 0x00000000`00000000) [D:\winx64-debug\build\src\storage\innobase\buf\buf0flu.cc @ 2098]
      kernel32!BaseThreadInitThunk
      ntdll!RtlUserThreadStart
       
      .  4  Id: 13ec.2b80 Suspend: 0 Teb: 00000010`4e082000 Unfrozen
            Priority: 0  Priority class: 32
       
      ntdll!NtWaitForWorkViaWorkerFactory
      ntdll!TppWorkerThread
      kernel32!BaseThreadInitThunk
      ntdll!RtlUserThreadStart
       
      .  5  Id: 13ec.271c Suspend: 0 Teb: 00000010`4e084000 Unfrozen
            Priority: 0  Priority class: 32
       
      ntdll!NtWaitForAlertByThreadId
      ntdll!RtlSleepConditionVariableCS
      KERNELBASE!SleepConditionVariableCS
      server!pthread_cond_timedwait(struct _RTL_CONDITION_VARIABLE * cond = 0x00007ffb`df7ebc70, struct _RTL_CRITICAL_SECTION * mutex = 0x00007ffb`df7ebc40, struct timespec * abstime = 0x00000000`00000000) [D:\winx64-debug\build\src\mysys\my_wincond.c @ 82]
      server!pthread_cond_wait(struct _RTL_CONDITION_VARIABLE * cond = 0x00007ffb`df7ebc70, struct _RTL_CRITICAL_SECTION * mutex = 0x00007ffb`df7ebc40) [D:\winx64-debug\build\src\mysys\my_wincond.c @ 91]
      server!inline_mysql_cond_wait(struct st_mysql_cond * that = 0x00007ffb`df7ebc70, struct st_mysql_mutex * mutex = 0x00007ffb`df7ebc40, char * src_file = 0x00007ffb`ddb10f80 "D:\winx64-debug\build\src\sql\log.cc", unsigned int src_line = 0x2859) [D:\winx64-debug\build\src\include\mysql\psi\mysql_thread.h @ 1222]
      server!binlog_background_thread(void * arg = 0x00000000`00000000) [D:\winx64-debug\build\src\sql\log.cc @ 10330]
      server!pfs_spawn_thread(void * arg = 0x00000171`41cc74a8) [D:\winx64-debug\build\src\storage\perfschema\pfs.cc @ 2203]
      server!pthread_start(void * p = 0x00000171`420302f0) [D:\winx64-debug\build\src\mysys\my_winthread.c @ 61]
      ucrtbase!o_exp
      kernel32!BaseThreadInitThunk
      ntdll!RtlUserThreadStart
       
      .  6  Id: 13ec.1f0 Suspend: 0 Teb: 00000010`4e08c000 Unfrozen
            Priority: 0  Priority class: 32
       
      ntdll!NtWaitForAlertByThreadId
      ntdll!RtlSleepConditionVariableCS
      KERNELBASE!SleepConditionVariableCS
      server!pthread_cond_timedwait(struct _RTL_CONDITION_VARIABLE * cond = 0x00007ffb`df7f1da8, struct _RTL_CRITICAL_SECTION * mutex = 0x00007ffb`df7f1be0, struct timespec * abstime = 0x00000000`00000000) [D:\winx64-debug\build\src\mysys\my_wincond.c @ 82]
      server!pthread_cond_wait(struct _RTL_CONDITION_VARIABLE * cond = 0x00007ffb`df7f1da8, struct _RTL_CRITICAL_SECTION * mutex = 0x00007ffb`df7f1be0) [D:\winx64-debug\build\src\mysys\my_wincond.c @ 91]
      server!inline_mysql_cond_wait(struct st_mysql_cond * that = 0x00007ffb`df7f1da8, struct st_mysql_mutex * mutex = 0x00007ffb`df7f1be0, char * src_file = 0x00007ffb`ddb98198 "D:\winx64-debug\build\src\sql\slave.cc", unsigned int src_line = 0x20d) [D:\winx64-debug\build\src\include\mysql\psi\mysql_thread.h @ 1222]
      server!handle_slave_background(void * arg = 0x00000000`00000000) [D:\winx64-debug\build\src\sql\slave.cc @ 526]
      server!pfs_spawn_thread(void * arg = 0x00000171`451f1438) [D:\winx64-debug\build\src\storage\perfschema\pfs.cc @ 2203]
      server!pthread_start(void * p = 0x00000171`41cc7620) [D:\winx64-debug\build\src\mysys\my_winthread.c @ 61]
      ucrtbase!o_exp
      kernel32!BaseThreadInitThunk
      ntdll!RtlUserThreadStart
       
      .  7  Id: 13ec.2588 Suspend: 0 Teb: 00000010`4e08e000 Unfrozen
            Priority: 0  Priority class: 32
       
      ntdll!NtWaitForAlertByThreadId
      ntdll!RtlSleepConditionVariableCS
      KERNELBASE!SleepConditionVariableCS
      server!pthread_cond_timedwait(struct _RTL_CONDITION_VARIABLE * cond = 0x00007ffb`df7eb568, struct _RTL_CRITICAL_SECTION * mutex = 0x00007ffb`df7eb538, struct timespec * abstime = 0x00000000`00000000) [D:\winx64-debug\build\src\mysys\my_wincond.c @ 82]
      server!pthread_cond_wait(struct _RTL_CONDITION_VARIABLE * cond = 0x00007ffb`df7eb568, struct _RTL_CRITICAL_SECTION * mutex = 0x00007ffb`df7eb538) [D:\winx64-debug\build\src\mysys\my_wincond.c @ 91]
      server!inline_mysql_cond_wait(struct st_mysql_cond * that = 0x00007ffb`df7eb568, struct st_mysql_mutex * mutex = 0x00007ffb`df7eb538, char * src_file = 0x00007ffb`ddb167d0 "D:\winx64-debug\build\src\sql\log.cc", unsigned int src_line = 0x10f8) [D:\winx64-debug\build\src\include\mysql\psi\mysql_thread.h @ 1222]
      server!MYSQL_BIN_LOG::reset_logs(class THD * thd = 0x00000171`45211bc8, bool create_new_log = true, struct rpl_gtid * init_state = 0x00000000`00000000, unsigned int init_state_len = 0, unsigned long next_log_number = 0) [D:\winx64-debug\build\src\sql\log.cc @ 4345]
      server!reset_master(class THD * thd = 0x00000171`45211bc8, struct rpl_gtid * init_state = 0x00000000`00000000, unsigned int init_state_len = 0, unsigned long next_log_number = 0) [D:\winx64-debug\build\src\sql\sql_repl.cc @ 3966]
      server!reload_acl_and_cache(class THD * thd = 0x00000171`45211bc8, unsigned int64 options = 0x80, struct TABLE_LIST * tables = 0x00000000`00000000, int * write_to_binlog = 0x00000010`4dfadf24) [D:\winx64-debug\build\src\sql\sql_reload.cc @ 362]
      server!mysql_execute_command(class THD * thd = 0x00000171`45211bc8) [D:\winx64-debug\build\src\sql\sql_parse.cc @ 5489]
      server!mysql_parse(class THD * thd = 0x00000171`45211bc8, char * rawbuf = 0x00000171`4521c7b0 "--- memory read error at address 0x00000171`4521c7b0 ---", unsigned int length = 0xc, class Parser_state * parser_state = 0x00000010`4dfaed00, bool is_com_multi = false, bool is_next_command = false) [D:\winx64-debug\build\src\sql\sql_parse.cc @ 8062]
      server!dispatch_command(enum_server_command command = COM_QUERY (0n3), class THD * thd = 0x00000171`45211bc8, char * packet = 0x00000171`45151c09 "--- memory read error at address 0x00000171`45151c09 ---", unsigned int packet_length = 0xc, bool is_com_multi = false, bool is_next_command = false) [D:\winx64-debug\build\src\sql\sql_parse.cc @ 1892]
      server!do_command(class THD * thd = 0x00000171`45211bc8) [D:\winx64-debug\build\src\sql\sql_parse.cc @ 1370]
      server!threadpool_process_request(class THD * thd = 0x00000171`45211bc8) [D:\winx64-debug\build\src\sql\threadpool_common.cc @ 363]
      server!tp_callback(struct TP_connection * c = 0x00000171`450fc960) [D:\winx64-debug\build\src\sql\threadpool_common.cc @ 194]
      server!tp_callback(struct _TP_CALLBACK_INSTANCE * instance = 0x00000010`4dfafca8, void * context = 0x00000171`450fc960) [D:\winx64-debug\build\src\sql\threadpool_win.cc @ 343]
      server!work_callback(struct _TP_CALLBACK_INSTANCE * instance = 0x00000010`4dfafca8, void * context = 0x00000171`450fc960, struct _TP_WORK * work = 0x00000171`453323f0) [D:\winx64-debug\build\src\sql\threadpool_win.cc @ 394]
      ntdll!TppWorkpExecuteCallback
      ntdll!TppWorkerThread
      kernel32!BaseThreadInitThunk
      ntdll!RtlUserThreadStart
       
      Total threads: 8
      quit:
       
       - found 'mysqltest.dmp' (1/5)
       
      Trying 'cdb' to get a backtrace
      Output from cdb follows. Faulting thread is printed twice,with and without function parameters
      Search for STACK_TEXT to see the stack trace of 
      the faulting thread. Callstacks of other threads are printed after it.
       
      Microsoft (R) Windows Debugger Version 10.0.16299.15 AMD64
      Copyright (c) Microsoft Corporation. All rights reserved.
       
       
      Loading Dump File [D:\winx64-debug\build\mysql-test\var\3\log\main.sp_trans_log-innodb\mysqltest.dmp]
      User Mini Dump File: Only registers, stack and portions of memory are available
       
       
      Response                         Time (ms)     Location
      OK                                             D:\winx64-debug\build\client\Debug
      OK                                             C:\Windows\System32
      OK                                             .
       
      Response                         Time (ms)     Location
      OK                                             D:\winx64-debug\build\client\Debug
      OK                                             C:\Windows\System32
      OK                                             .
      Deferred                                       cache*C:\cdb_symbols
      Symbol search path is: D:\winx64-debug\build\client\Debug;C:\Windows\System32;.;cache*C:\cdb_symbols
      Executable search path is: D:\winx64-debug\build\client\Debug;C:\Windows\System32;.
      Windows 10 Version 17763 MP (4 procs) Free x64
      Product: Server, suite: TerminalServer DataCenter SingleUserTS
      17763.1.amd64fre.rs5_release.180914-1434
      Machine Name:
      Debug session time: Sun Jan 17 12:54:51.000 2021 (UTC + 0:00)
      System Uptime: not available
      Process Uptime: 0 days 0:15:00.000
      ...................................
      ntdll!NtWaitForSingleObject:
                   ret
      0:000> cdb: Reading initial command '!sym prompts off; !analyze -v; .ecxr; !for_each_frame dv /t;!uniqstack -p;q'
      quiet mode - symbol prompts off
       
      GetUrlPageData2 (WinHttp) failed: 12002.
       
      DUMP_CLASS: 2
       
      DUMP_QUALIFIER: 400
       
      FAULTING_IP: 
      +0
      ??              ???
       
      EXCEPTION_RECORD:  (.exr -1)
      ExceptionAddress: 0000000000000000
         ExceptionCode: 80000003 (Break instruction exception)
        ExceptionFlags: 00000000
      NumberParameters: 0
       
      FAULTING_THREAD:  000011ac
       
      BUGCHECK_STR:  BREAKPOINT
       
      DEFAULT_BUCKET_ID:  BREAKPOINT
       
      PROCESS_NAME:  mysqltest.exe
       
      ERROR_CODE: (NTSTATUS) 0x80000003 - {EXCEPTION}  Breakpoint  A breakpoint has been reached.
       
      EXCEPTION_CODE: (HRESULT) 0x80000003 (2147483651) - One or more arguments are invalid
       
      EXCEPTION_CODE_STR:  80000003
       
      WATSON_BKT_PROCSTAMP:  60042fbf
       
      WATSON_BKT_PROCVER:  10.5.9.0
       
      WATSON_BKT_MODULE:  unknown
       
      WATSON_BKT_MODVER:  0.0.0.0
       
      WATSON_BKT_MODOFFSET:  0
       
      WATSON_BKT_MODSTAMP:  bbbbbbb4
       
      BUILD_VERSION_STRING:  10.0.17763.475 (WinBuild.160101.0800)
       
      MODLIST_WITH_TSCHKSUM_HASH:  a48c6fc7830b4f6c7313c1a689fb78ae8abdc151
       
      MODLIST_SHA1_HASH:  703f16b304dfd1d23fdf184b9749047d8bf9a6a2
       
      DUMP_FLAGS:  0
       
      DUMP_TYPE:  2
       
      ANALYSIS_SESSION_HOST:  MARIADB-02
       
      ANALYSIS_SESSION_TIME:  01-17-2021 12:55:58.0365
       
      ANALYSIS_VERSION: 10.0.16299.15 amd64fre
       
      THREAD_ATTRIBUTES: 
      PROBLEM_CLASSES: 
       
          ID:     [0n309]
          Type:   [@APPLICATION_FAULT_STRING]
          Class:  Primary
          Scope:  DEFAULT_BUCKET_ID (Failure Bucket ID prefix)
                  BUCKET_ID
          Name:   Omit
          Data:   Add
                  String: [BREAKPOINT]
          PID:    [Unspecified]
          TID:    [Unspecified]
          Frame:  [0]
       
      PRIMARY_PROBLEM_CLASS:  BREAKPOINT
       
      LAST_CONTROL_TRANSFER:  from 00007ffc2379a81d to 00007ffc2803f7e4
       
      STACK_TEXT:  
      ntdll!NtWaitForSingleObject
      mswsock!WSPStartup
      mswsock!WSPStartup
      ws2_32!recv
      mysqltest!ma_recv
      mysqltest!pvio_socket_read
      mysqltest!ma_pvio_read
      mysqltest!ma_pvio_cache_read
      mysqltest!ma_real_read
      mysqltest!ma_net_read
      mysqltest!ma_net_safe_read
      mysqltest!mthd_my_read_query_result
      mysqltest!mysql_read_query_result
      mysqltest!wrap_mysql_read_query_result
      mysqltest!run_query_normal
      mysqltest!run_query
      mysqltest!main
      mysqltest!__scrt_common_main_seh
      kernel32!BaseThreadInitThunk
      ntdll!RtlUserThreadStart
       
       
      STACK_COMMAND:  ~0s; .ecxr ; kb
       
      THREAD_SHA1_HASH_MOD_FUNC:  07d3b96a0b348b38ecbeccb3c6ae2131e9219e73
       
      THREAD_SHA1_HASH_MOD_FUNC_OFFSET:  7ce85fa9984d99cefdb8081cd2b034d66dbd5fd0
       
      THREAD_SHA1_HASH_MOD:  491b853626676b0ba73724c7a0d657fa3bbfb77e
       
      FOLLOWUP_IP: 
      mswsock!WSPStartup+5d7d
                 mov     ebx,eax
       
      FAULT_INSTR_CODE:  23dd88b
       
      SYMBOL_STACK_INDEX:  1
       
      SYMBOL_NAME:  mswsock!WSPStartup+5d7d
       
      FOLLOWUP_NAME:  MachineOwner
       
      MODULE_NAME: mswsock
       
      IMAGE_NAME:  mswsock.dll
       
      DEBUG_FLR_IMAGE_TIMESTAMP:  72315049
       
      BUCKET_ID:  BREAKPOINT_mswsock!WSPStartup+5d7d
       
      FAILURE_EXCEPTION_CODE:  80000003
       
      FAILURE_IMAGE_NAME:  mswsock.dll
       
      BUCKET_ID_IMAGE_STR:  mswsock.dll
       
      FAILURE_MODULE_NAME:  mswsock
       
      BUCKET_ID_MODULE_STR:  mswsock
       
      FAILURE_FUNCTION_NAME:  WSPStartup
       
      BUCKET_ID_FUNCTION_STR:  WSPStartup
       
      BUCKET_ID_OFFSET:  5d7d
       
      BUCKET_ID_MODTIMEDATESTAMP:  72315049
       
      BUCKET_ID_MODCHECKSUM:  6d5d7
       
      BUCKET_ID_MODVER_STR:  6.2.17763.1192
       
      BUCKET_ID_PREFIX_STR:  BREAKPOINT_
       
      FAILURE_PROBLEM_CLASS:  BREAKPOINT
       
      FAILURE_SYMBOL_NAME:  mswsock.dll!WSPStartup
       
      FAILURE_BUCKET_ID:  BREAKPOINT_80000003_mswsock.dll!WSPStartup
       
      WATSON_STAGEONE_URL:  http://watson.microsoft.com/StageOne/mysqltest.exe/10.5.9.0/60042fbf/unknown/0.0.0.0/bbbbbbb4/80000003/00000000.htm?Retriage=1
       
      TARGET_TIME:  2021-01-17T12:54:51.000Z
       
      OSBUILD:  17763
       
      OSSERVICEPACK:  475
       
      SERVICEPACK_NUMBER: 0
       
      OS_REVISION: 0
       
      SUITE_MASK:  400
       
      PRODUCT_TYPE:  3
       
      OSPLATFORM_TYPE:  x64
       
      OSNAME:  Windows 10
       
      OSEDITION:  Windows 10 Server TerminalServer DataCenter SingleUserTS
       
      OS_LOCALE:  
       
      USER_LCID:  0
       
      OSBUILD_TIMESTAMP:  1989-09-10 06:58:46
       
      BUILDDATESTAMP_STR:  160101.0800
       
      BUILDLAB_STR:  WinBuild
       
      BUILDOSVER_STR:  10.0.17763.475
       
      ANALYSIS_SESSION_ELAPSED_TIME:  5356
       
      ANALYSIS_SOURCE:  UM
       
      FAILURE_ID_HASH_STRING:  um:breakpoint_80000003_mswsock.dll!wspstartup
       
      FAILURE_ID_HASH:  {f3afa2b9-b7d6-ddd6-e19c-c4fbbd5047ba}
       
      Followup:     MachineOwner
      ---------
       
      Minidump doesn't have an exception context
      Unable to get exception context, HRESULT 0x80004002
      _ _ _ _ _ _ _ _ _ _ _ _ _ _ _ _
      ntdll!NtWaitForSingleObject
      Unable to enumerate locals, Win32 error 0n87
      Private symbols (symbols.pri) are required for locals.
      Type ".hh dbgerr005" for details.
      _ _ _ _ _ _ _ _ _ _ _ _ _ _ _ _
      mswsock!WSPStartup
      Unable to enumerate locals, Win32 error 0n318
      Private symbols (symbols.pri) are required for locals.
      Type ".hh dbgerr005" for details.
      _ _ _ _ _ _ _ _ _ _ _ _ _ _ _ _
      mswsock!WSPStartup
      Unable to enumerate locals, Win32 error 0n318
      Private symbols (symbols.pri) are required for locals.
      Type ".hh dbgerr005" for details.
      _ _ _ _ _ _ _ _ _ _ _ _ _ _ _ _
      ws2_32!recv
      Unable to enumerate locals, Win32 error 0n318
      Private symbols (symbols.pri) are required for locals.
      Type ".hh dbgerr005" for details.
      _ _ _ _ _ _ _ _ _ _ _ _ _ _ _ _
      mysqltest!ma_recv [D:\winx64-debug\build\src\libmariadb\plugins\pvio\pvio_socket.c @ 392]
      unsigned int64 socket = 0x248
      unsigned char * buffer = 0x00000138`53ad72a0 "--- memory read error at address 0x00000138`53ad72a0 ---"
      unsigned int64 length = 0x4000
      int flags = 0n0
      int64 r = 0n-3689348814741910324
      _ _ _ _ _ _ _ _ _ _ _ _ _ _ _ _
      mysqltest!pvio_socket_read [D:\winx64-debug\build\src\libmariadb\plugins\pvio\pvio_socket.c @ 308]
      struct st_ma_pvio * pvio = 0x00000138`53a923b0
      unsigned char * buffer = 0x00000138`53ad72a0 "--- memory read error at address 0x00000138`53ad72a0 ---"
      unsigned int64 length = 0x4000
      int64 r = 0n-3689348814741910324
      struct st_pvio_socket * csock = 0x00000138`53ab8800
      int timeout = 0n-1
      int read_flags = 0n0
      _ _ _ _ _ _ _ _ _ _ _ _ _ _ _ _
      mysqltest!ma_pvio_read [D:\winx64-debug\build\src\libmariadb\libmariadb\ma_pvio.c @ 255]
      struct st_ma_pvio * pvio = 0x00000138`53a923b0
      unsigned char * buffer = 0x00000138`53ad72a0 "--- memory read error at address 0x00000138`53ad72a0 ---"
      unsigned int64 length = 0x4000
      int64 r = 0n-1
      _ _ _ _ _ _ _ _ _ _ _ _ _ _ _ _
      mysqltest!ma_pvio_cache_read [D:\winx64-debug\build\src\libmariadb\libmariadb\ma_pvio.c @ 297]
      struct st_ma_pvio * pvio = 0x00000138`53a923b0
      unsigned char * buffer = 0x00000138`53b0e570 "--- memory read error at address 0x00000138`53b0e570 ---"
      unsigned int64 length = 4
      int64 r = 0n-3689348814741910324
      _ _ _ _ _ _ _ _ _ _ _ _ _ _ _ _
      mysqltest!ma_real_read [D:\winx64-debug\build\src\libmariadb\libmariadb\ma_net.c @ 380]
      struct st_net * net = 0x00000138`53b08830
      unsigned int64 * complen = 0x00000012`f61af2b8
      int64 length = 0n-3689348814741910324
      unsigned int i = 0
      unsigned int64 remain = 4
      unsigned char * pos = 0x00000138`53b0e570 "--- memory read error at address 0x00000138`53b0e570 ---"
      unsigned long len = 0xffffffff
      _ _ _ _ _ _ _ _ _ _ _ _ _ _ _ _
      mysqltest!ma_net_read [D:\winx64-debug\build\src\libmariadb\libmariadb\ma_net.c @ 434]
      struct st_net * net = 0x00000138`53b08830
      unsigned int64 complen = 0
      unsigned int64 len = 0xcccccccc`cccccccc
      _ _ _ _ _ _ _ _ _ _ _ _ _ _ _ _
      mysqltest!ma_net_safe_read [D:\winx64-debug\build\src\libmariadb\libmariadb\mariadb_lib.c @ 200]
      struct st_mysql * mysql = 0x00000138`53b08830
      struct st_net * net = 0x00000138`53b08830
      unsigned long len = 0
      _ _ _ _ _ _ _ _ _ _ _ _ _ _ _ _
      mysqltest!mthd_my_read_query_result [D:\winx64-debug\build\src\libmariadb\libmariadb\mariadb_lib.c @ 2314]
      struct st_mysql * mysql = 0x00000138`53b08830
      struct st_mysql_data * fields = 0xcccccccc`cccccccc
      unsigned long field_count = 0xcccccccc
      unsigned long length = 0xcccccccc
      unsigned char * pos = 0xcccccccc`cccccccc "--- memory read error at address 0xcccccccc`cccccccc ---"
      char can_local_infile = 0n0 ''
      _ _ _ _ _ _ _ _ _ _ _ _ _ _ _ _
      mysqltest!mysql_read_query_result [D:\winx64-debug\build\src\libmariadb\libmariadb\mariadb_lib.c @ 2371]
      struct st_mysql * mysql = 0x00000138`53b08830
      _ _ _ _ _ _ _ _ _ _ _ _ _ _ _ _
      mysqltest!wrap_mysql_read_query_result [D:\winx64-debug\build\src\tests\nonblock-wrappers.h @ 324]
      struct st_mysql * mysql = 0x00000138`53b08830
      char res = 0n-52 ''
      int status = 0n-858993460
      _ _ _ _ _ _ _ _ _ _ _ _ _ _ _ _
      mysqltest!run_query_normal [D:\winx64-debug\build\src\client\mysqltest.cc @ 7929]
      struct st_connection * cn = 0x00000138`53a90ff8
      struct st_command * command = 0x00000138`53b17988
      int flags = 0n3
      char * query = 0x00000138`53b153e8 "--- memory read error at address 0x00000138`53b153e8 ---"
      unsigned int64 query_len = 0xc
      struct st_dynamic_string * ds = 0x00007ff7`4aaa59b0
      struct st_dynamic_string * ds_warnings = 0x00000012`f61af6a8
      int err = 0n0
      struct st_mysql_res * res = 0x00000000`00000000
      struct _db_stack_frame_ _db_stack_frame_ = struct _db_stack_frame_
      struct st_mysql * mysql = 0x00000138`53b08830
      int counter = 0n0
      _ _ _ _ _ _ _ _ _ _ _ _ _ _ _ _
      mysqltest!run_query [D:\winx64-debug\build\src\client\mysqltest.cc @ 8715]
      struct st_connection * cn = 0x00000138`53a90ff8
      struct st_command * command = 0x00000138`53b17988
      int flags = 0n3
      struct st_dynamic_string ds_sorted = struct st_dynamic_string
      char * query = 0x00000138`53b153e8 "--- memory read error at address 0x00000138`53b153e8 ---"
      char view_created = 0n0 ''
      char sp_created = 0n0 ''
      char complete_query = 0n1 ''
      struct _db_stack_frame_ _db_stack_frame_ = struct _db_stack_frame_
      struct st_dynamic_string * ds = 0x00007ff7`4aaa59b0
      struct st_mysql * mysql = 0x00000138`53b08830
      struct st_dynamic_string * save_ds = 0x00000000`00000000
      struct st_dynamic_string ds_result = struct st_dynamic_string
      struct st_dynamic_string ds_warnings = struct st_dynamic_string
      unsigned int64 query_len = 0xc
      _ _ _ _ _ _ _ _ _ _ _ _ _ _ _ _
      mysqltest!main [D:\winx64-debug\build\src\client\mysqltest.cc @ 9532]
      int flags = 0n3
      char old_display_result_vertically = 0n0 ''
      int current_line_inc = 0n1
      char ok_to_do = 0n1 ''
      int processed = 0n1
      int argc = 0n12
      char ** argv = 0x00000138`53aa2a70
      unsigned int command_executed = 7
      char q_send_flag = 0n0 ''
      unsigned int last_command_executed = 7
      struct _db_stack_frame_ _db_stack_frame_ = struct _db_stack_frame_
      struct st_connection * con = 0x00000138`53a90ff8
      struct st_command * command = 0x00000138`53b17988
      char [512] save_file = char [512] ""
      char abort_flag = 0n0 ''
      bool empty_result = false
      _ _ _ _ _ _ _ _ _ _ _ _ _ _ _ _
      (Inline Function) --------`-------- mysqltest!invoke_main [d:\agent\_work\63\s\src\vctools\crt\vcstartup\src\startup\exe_common.inl @ 78]
      _ _ _ _ _ _ _ _ _ _ _ _ _ _ _ _
      mysqltest!__scrt_common_main_seh [d:\agent\_work\63\s\src\vctools\crt\vcstartup\src\startup\exe_common.inl @ 288]
      bool has_cctor = false
      int main_result = <value unavailable>
      <function> ** tls_init_callback = <value unavailable>
      bool is_nested = <value unavailable>
      <function> ** tls_dtor_callback = <value unavailable>
      int main_result = <value unavailable>
      __scrt_native_startup_state __scrt_current_native_startup_state = <value unavailable>
      _ _ _ _ _ _ _ _ _ _ _ _ _ _ _ _
      kernel32!BaseThreadInitThunk
      Unable to enumerate locals, Win32 error 0n87
      Private symbols (symbols.pri) are required for locals.
      Type ".hh dbgerr005" for details.
      _ _ _ _ _ _ _ _ _ _ _ _ _ _ _ _
      ntdll!RtlUserThreadStart
      Unable to enumerate locals, Win32 error 0n87
      Private symbols (symbols.pri) are required for locals.
      Type ".hh dbgerr005" for details.
      _ _ _ _ _ _ _ _ _ _ _ _ _ _ _ _
      ntdll!NtWaitForSingleObject
      Processing 1 threads, please wait
       
      .  0  Id: 25f8.11ac Suspend: 0 Teb: 00000012`f63a9000 Unfrozen
            Priority: 0  Priority class: 32
       
      ntdll!NtWaitForSingleObject
      mswsock!WSPStartup
      mswsock!WSPStartup
      ws2_32!recv
      mysqltest!ma_recv(unsigned int64 socket = 0x248, unsigned char * buffer = 0x00000138`53ad72a0 "--- memory read error at address 0x00000138`53ad72a0 ---", unsigned int64 length = 0x4000, int flags = 0n0) [D:\winx64-debug\build\src\libmariadb\plugins\pvio\pvio_socket.c @ 392]
      mysqltest!pvio_socket_read(struct st_ma_pvio * pvio = 0x00000138`53a923b0, unsigned char * buffer = 0x00000138`53ad72a0 "--- memory read error at address 0x00000138`53ad72a0 ---", unsigned int64 length = 0x4000) [D:\winx64-debug\build\src\libmariadb\plugins\pvio\pvio_socket.c @ 308]
      mysqltest!ma_pvio_read(struct st_ma_pvio * pvio = 0x00000138`53a923b0, unsigned char * buffer = 0x00000138`53ad72a0 "--- memory read error at address 0x00000138`53ad72a0 ---", unsigned int64 length = 0x4000) [D:\winx64-debug\build\src\libmariadb\libmariadb\ma_pvio.c @ 255]
      mysqltest!ma_pvio_cache_read(struct st_ma_pvio * pvio = 0x00000138`53a923b0, unsigned char * buffer = 0x00000138`53b0e570 "--- memory read error at address 0x00000138`53b0e570 ---", unsigned int64 length = 4) [D:\winx64-debug\build\src\libmariadb\libmariadb\ma_pvio.c @ 297]
      mysqltest!ma_real_read(struct st_net * net = 0x00000138`53b08830, unsigned int64 * complen = 0x00000012`f61af2b8) [D:\winx64-debug\build\src\libmariadb\libmariadb\ma_net.c @ 380]
      mysqltest!ma_net_read(struct st_net * net = 0x00000138`53b08830) [D:\winx64-debug\build\src\libmariadb\libmariadb\ma_net.c @ 434]
      mysqltest!ma_net_safe_read(struct st_mysql * mysql = 0x00000138`53b08830) [D:\winx64-debug\build\src\libmariadb\libmariadb\mariadb_lib.c @ 200]
      mysqltest!mthd_my_read_query_result(struct st_mysql * mysql = 0x00000138`53b08830) [D:\winx64-debug\build\src\libmariadb\libmariadb\mariadb_lib.c @ 2314]
      mysqltest!mysql_read_query_result(struct st_mysql * mysql = 0x00000138`53b08830) [D:\winx64-debug\build\src\libmariadb\libmariadb\mariadb_lib.c @ 2371]
      mysqltest!wrap_mysql_read_query_result(struct st_mysql * mysql = 0x00000138`53b08830) [D:\winx64-debug\build\src\tests\nonblock-wrappers.h @ 324]
      mysqltest!run_query_normal(struct st_connection * cn = 0x00000138`53a90ff8, struct st_command * command = 0x00000138`53b17988, int flags = 0n3, char * query = 0x00000138`53b153e8 "--- memory read error at address 0x00000138`53b153e8 ---", unsigned int64 query_len = 0xc, struct st_dynamic_string * ds = 0x00007ff7`4aaa59b0, struct st_dynamic_string * ds_warnings = 0x00000012`f61af6a8) [D:\winx64-debug\build\src\client\mysqltest.cc @ 7929]
      mysqltest!run_query(struct st_connection * cn = 0x00000138`53a90ff8, struct st_command * command = 0x00000138`53b17988, int flags = 0n3) [D:\winx64-debug\build\src\client\mysqltest.cc @ 8715]
      mysqltest!main(int argc = 0n12, char ** argv = 0x00000138`53aa2a70) [D:\winx64-debug\build\src\client\mysqltest.cc @ 9532]
      (Inline Function) --------`-------- mysqltest!invoke_main [d:\agent\_work\63\s\src\vctools\crt\vcstartup\src\startup\exe_common.inl @ 78]
      mysqltest!__scrt_common_main_seh(void) [d:\agent\_work\63\s\src\vctools\crt\vcstartup\src\startup\exe_common.inl @ 288]
      kernel32!BaseThreadInitThunk
      ntdll!RtlUserThreadStart
      

        Attachments

          Issue Links

            Activity

              People

              Assignee:
              Elkin Andrei Elkin
              Reporter:
              elenst Elena Stepanova
              Votes:
              0 Vote for this issue
              Watchers:
              1 Start watching this issue

                Dates

                Created:
                Updated:

                  Git Integration

                  Error rendering 'com.xiplink.jira.git.jira_git_plugin:git-issue-webpanel'. Please contact your Jira administrators.