Uploaded image for project: 'MariaDB Server'
  1. MariaDB Server
  2. MDEV-16073

mtr Galera tests from rpm MariaDB-test package installation fails with WSREP Unknown error 255

    XMLWordPrintable

    Details

      Description

      mtr Galera tests from rpm MariaDB-test package installation fails with WSREP Unknown error 255

      MariaDB-server , MariaDB-client, MariaDB-common and MariaDB-backup are
      installed from mariadb-10.3.6 rpms packages
      then run mtr galera test suites. mtr Galera tests fail with WSREP Unknown error 255

      Install MariaDB-*-10.3.6 .el7.centos.x86_64 below packadge list from:
      http://mirror.host.ag/mariadb//mariadb-10.3.6/yum/centos7-amd64/rpms/

      MariaDB-test-10.3.6-1.el7.centos.x86_64
      MariaDB-shared-10.3.6-1.el7.centos.x86_64
      MariaDB-server-10.3.6-1.el7.centos.x86_64
      MariaDB-devel-10.3.6-1.el7.centos.x86_64
      MariaDB-compat-10.3.6-1.el7.centos.x86_64
      MariaDB-common-10.3.6-1.el7.centos.x86_64
      MariaDB-client-10.3.6-1.el7.centos.x86_64
      MariaDB-backup-10.3.6-1.el7.centos.x86_64
      
      

      Run mysql-test-run.pl galera test suite.Galera tests fail with WSREP Unknown error 255

      [root@t4w6 ~]# cd /usr/share/mysql-test/
      [root@t4w6 mysql-test]#  ./mysql-test-run.pl --suite=galera  --force --big-test
      Logging: ./mysql-test-run.pl  --suite=galera --force --big-test
      vardir: /usr/share/mysql-test/var
      Checking leftover processes...
      Removing old var directory...
      Creating var directory '/usr/share/mysql-test/var'...
      Checking supported features...
      MariaDB Version 10.3.6-MariaDB
       - SSL connections supported
      Using suites: galera
      Collecting tests...
      Installing system database...
       
      ==============================================================================
       
      TEST                                      RESULT   TIME (ms) or COMMENT
      --------------------------------------------------------------------------
       
      worker[1] Using MTR_BUILD_THREAD 300, with reserved ports 16000..16019
      worker[1] mysql-test-run: WARNING: running this script as _root_ will cause some tests to be skipped
      galera.GAL-419                           [ disabled ]  MDEV-13549 Galera test failures
      galera.GAL-480                           [ disabled ]  "Lost connection to MySQL"
      galera.MW-328A                           [ disabled ]  have_deadlocks test not stable
      galera.MW-329                            [ disabled ]  wsrep_local_replays not stable
      galera.MW-44                             [ disabled ]  MDEV-15809 Test failure on galera.MW-44
      galera.galera_account_management         [ disabled ]  MariaDB 10.0 does not support ALTER USER
      galera.galera_as_master_gtid             [ disabled ]  Requires MySQL GTID
      galera.galera_as_master_gtid_change_master [ disabled ]  Requires MySQL GTID
      galera.galera_as_slave_preordered        [ disabled ]  wsrep-preordered feature not merged to MariaDB
      galera.galera_as_slave_replication_bundle [ disabled ]  MDEV-13549 Galera test failures
      galera.galera_binlog_rows_query_log_events [ disabled ]  MariaDB does not support binlog_rows_query_log_events
      galera.galera_concurrent_ctas            [ disabled ]  MDEV-15845 Test failure on galera.galera_concurrent_ctas
      galera.galera_flush                      [ disabled ]  MariaDB does not have global.thread_statistics
      galera.galera_gcache_recover             [ disabled ]  MDEV-13549 Galera test failures
      galera.galera_gcache_recover_full_gcache [ disabled ]  MDEV-13549 Galera test failures
      galera.galera_gcache_recover_manytrx     [ disabled ]  MDEV-13549 Galera test failures
      galera.galera_gra_log                    [ disabled ]  MDEV-15808 Test failure on galera.galera_gra_log
      galera.galera_ist_mysqldump              [ disabled ]  MDEV-13549 Galera test failures
      galera.galera_ist_progress               [ disabled ]  MDEV-15236 galera_ist_progress fails when trying to read transfer status
      galera.galera_kill_applier               [ disabled ]  race condition at the start of the test
      galera.galera_migrate                    [ disabled ]  MariaDB does not support START SLAVE USER
      galera.galera_pc_ignore_sb               [ disabled ]  MDEV-15811 Test failure on galera_pc_ignore_sb
      galera.galera_ssl_upgrade                [ disabled ]  MDEV-13549 Galera test failures
      galera.galera_sst_mysqldump              [ disabled ]  MDEV-14069
      galera.galera_var_auto_inc_control_on    [ disabled ]  MDEV-15803 Test failure on galera.galera_var_auto_inc_control_on
      galera.galera_var_notify_cmd             [ disabled ]  MDEV-13549 Galera test failures
      galera.galera_var_retry_autocommit       [ disabled ]  MDEV-15794 Test failure on galera.galera_var_retry_autocommit
      galera.pxc-421                           [ disabled ]  MDEV-15804 Test failure on galera.pxc-421
      galera.query_cache                       [ disabled ]  MDEV-15805 Test failure on galera.query_cache
      galera.MW-388                            [ skipped ]  Requires debug build
      galera.galera_sync_wait_show             [ skipped ]  Requires debug build
      galera.galera_toi_ddl_locking            [ skipped ]  Requires debug build
      galera.galera_autoinc_sst_xtrabackup 'innodb' [ skipped ]  Need innobackupex
      galera.galera_ist_xtrabackup-v2 'innodb,release' [ skipped ]  Need innobackupex
      galera.galera_sst_xtrabackup-v2-options 'innodb' [ skipped ]  Need innobackupex
      galera.galera_sst_xtrabackup-v2 'innodb,release' [ skipped ]  Need innobackupex
      galera.galera_sst_xtrabackup-v2_encrypt_with_key 'innodb' [ skipped ]  Need innobackupex
      worker[1] mysql-test-run: WARNING: Process [mysqld.2 - pid: 17202, winpid: 17202, exit: 256] died after mysql-test-run waited 13.9 seconds f                 or /usr/share/mysql-test/var/run/mysqld.2.pid to be created.
      galera.galera_binlog_checksum 'innodb'   [ fail ]
              Test ended at 2018-05-02 13:36:52
       
      CURRENT_TEST: galera.galera_binlog_checksum
       
       
      Failed to start mysqld.2
      mysqltest failed but provided no output
       
       
       - saving '/usr/share/mysql-test/var/log/galera.galera_binlog_checksum-innodb/' to '/usr/share/mysql-test/var/log/galera.galera_binlog_check                 sum-innodb/'
      ***Warnings generated in error logs during shutdown after running tests: galera.galera_binlog_checksum
       
      WSREP_SST: [ERROR] rsync returned code 23: (20180502 13:36:42.463)
      2018-05-02 13:36:42 0 [ERROR] WSREP: Failed to read from: wsrep_sst_rsync --role 'donor' --address '127.0.0.1:16007/rsync_sst' --socket '/us                 r/share/mysql-test/var/tmp/mysqld.1.sock' --datadir '/usr/share/mysql-test/var/mysqld.1/data/'  --defaults-file '/usr/share/mysql-test/var/m                 y.cnf' --defaults-group-suffix '.1'    '' --gtid 'b1bc8b14-4df4-11e8-a07b-2b24231d547e:0' --gtid-domain-id '0'
      2018-05-02 13:36:42 0 [ERROR] WSREP: Process completed with error: wsrep_sst_rsync --role 'donor' --address '127.0.0.1:16007/rsync_sst' --so                 cket '/usr/share/mysql-test/var/tmp/mysqld.1.sock' --datadir '/usr/share/mysql-test/var/mysqld.1/data/'  --defaults-file '/usr/share/mysql-t                 est/var/my.cnf' --defaults-group-suffix '.1'    '' --gtid 'b1bc8b14-4df4-11e8-a07b-2b24231d547e:0' --gtid-domain-id '0': 255 (Unknown error                  255)
      2018-05-02 13:36:42 0 [ERROR] WSREP: Command did not run: wsrep_sst_rsync --role 'donor' --address '127.0.0.1:16007/rsync_sst' --socket '/us                 r/share/mysql-test/var/tmp/mysqld.1.sock' --datadir '/usr/share/mysql-test/var/mysqld.1/data/'  --defaults-file '/usr/share/mysql-test/var/m                 y.cnf' --defaults-group-suffix '.1'    '' --gtid 'b1bc8b14-4df4-11e8-a07b-2b24231d547e:0' --gtid-domain-id '0'
      2018-05-02 13:36:42 0 [Warning] WSREP: 1.0 (t4w6.xentio.lan): State transfer to 0.0 (t4w6.xentio.lan) failed: -255 (Unknown error 255)
      2018-05-02 13:36:42 0 [Warning] WSREP: 1.0 (t4w6.xentio.lan): State transfer to 0.0 (t4w6.xentio.lan) failed: -255 (Unknown error 255)
      2018-05-02 13:36:42 0 [ERROR] WSREP: gcs/src/gcs_group.cpp:gcs_group_handle_join_msg():737: Will never receive state. Need to abort.
       
      worker[1] mysql-test-run: WARNING: Process [mysqld.2 - pid: 17383, winpid: 17383, exit: 256] died after mysql-test-run waited 12.5 seconds f                 or /usr/share/mysql-test/var/run/mysqld.2.pid to be created.
      galera.MW-313 'innodb'                   [ fail ]
              Test ended at 2018-05-02 13:37:06
       
      CURRENT_TEST: galera.galera_binlog_checksum
      CURRENT_TEST: galera.MW-313
       
       
      Failed to start mysqld.2
       
       
       - saving '/usr/share/mysql-test/var/log/galera.MW-313-innodb/' to '/usr/share/mysql-test/var/log/galera.MW-313-innodb/'
      ***Warnings generated in error logs during shutdown after running tests: galera.MW-313
       
      WSREP_SST: [ERROR] rsync returned code 23: (20180502 13:36:55.888)
      2018-05-02 13:36:55 0 [ERROR] WSREP: Failed to read from: wsrep_sst_rsync --role 'donor' --address '127.0.0.1:16007/rsync_sst' --socket '/us                 r/share/mysql-test/var/tmp/mysqld.1.sock' --datadir '/usr/share/mysql-test/var/mysqld.1/data/'  --defaults-file '/usr/share/mysql-test/var/m                 y.cnf' --defaults-group-suffix '.1'   --binlog 'mysqld-bin' --gtid 'ba92bff1-4df4-11e8-9e06-8fd7c8e61bee:0' --gtid-domain-id '0'
      2018-05-02 13:36:55 0 [ERROR] WSREP: Process completed with error: wsrep_sst_rsync --role 'donor' --address '127.0.0.1:16007/rsync_sst' --so                 cket '/usr/share/mysql-test/var/tmp/mysqld.1.sock' --datadir '/usr/share/mysql-test/var/mysqld.1/data/'  --defaults-file '/usr/share/mysql-t                 est/var/my.cnf' --defaults-group-suffix '.1'   --binlog 'mysqld-bin' --gtid 'ba92bff1-4df4-11e8-9e06-8fd7c8e61bee:0' --gtid-domain-id '0': 2                 55 (Unknown error 255)
      2018-05-02 13:36:55 0 [ERROR] WSREP: Command did not run: wsrep_sst_rsync --role 'donor' --address '127.0.0.1:16007/rsync_sst' --socket '/us                 r/share/mysql-test/var/tmp/mysqld.1.sock' --datadir '/usr/share/mysql-test/var/mysqld.1/data/'  --defaults-file '/usr/share/mysql-test/var/m                 y.cnf' --defaults-group-suffix '.1'   --binlog 'mysqld-bin' --gtid 'ba92bff1-4df4-11e8-9e06-8fd7c8e61bee:0' --gtid-domain-id '0'
      2018-05-02 13:36:55 0 [Warning] WSREP: 0.0 (t4w6.xentio.lan): State transfer to 1.0 (t4w6.xentio.lan) failed: -255 (Unknown error 255)
      WSREP_SST: [ERROR] Parent mysqld process (PID:17203) terminated unexpectedly. (20180502 13:36:53.456)
      2018-05-02 13:36:55 0 [Warning] WSREP: 0.0 (t4w6.xentio.lan): State transfer to 1.0 (t4w6.xentio.lan) failed: -255 (Unknown error 255)
      2018-05-02 13:36:55 0 [ERROR] WSREP: gcs/src/gcs_group.cpp:gcs_group_handle_join_msg():737: Will never receive state. Need to abort.
       
      worker[1] mysql-test-run: WARNING: Process [mysqld.2 - pid: 17589, winpid: 17589, exit: 256] died after mysql-test-run waited 13 seconds for                  /usr/share/mysql-test/var/run/mysqld.2.pid to be created.
      galera.MW-86-wait1 'innodb'              [ fail ]
              Test ended at 2018-05-02 13:37:19
       
      CURRENT_TEST: galera.galera_binlog_checksum
      CURRENT_TEST: galera.MW-313
      CURRENT_TEST: galera.MW-86-wait1
       
       
      Failed to start mysqld.2
       
       
       - saving '/usr/share/mysql-test/var/log/galera.MW-86-wait1-innodb/' to '/usr/share/mysql-test/var/log/galera.MW-86-wait1-innodb/'
      ***Warnings generated in error logs during shutdown after running tests: galera.MW-86-wait1
       
      WSREP_SST: [ERROR] rsync returned code 23: (20180502 13:37:09.183)
      2018-05-02 13:37:09 0 [ERROR] WSREP: Failed to read from: wsrep_sst_rsync --role 'donor' --address '127.0.0.1:16007/rsync_sst' --socket '/us                 r/share/mysql-test/var/tmp/mysqld.1.sock' --datadir '/usr/share/mysql-test/var/mysqld.1/data/'  --defaults-file '/usr/share/mysql-test/var/m                 y.cnf' --defaults-group-suffix '.1'   --binlog 'mysqld-bin' --gtid 'c28a1587-4df4-11e8-9152-b37ffe192a2a:0' --gtid-domain-id '0'
      2018-05-02 13:37:09 0 [ERROR] WSREP: Process completed with error: wsrep_sst_rsync --role 'donor' --address '127.0.0.1:16007/rsync_sst' --so                 cket '/usr/share/mysql-test/var/tmp/mysqld.1.sock' --datadir '/usr/share/mysql-test/var/mysqld.1/data/'  --defaults-file '/usr/share/mysql-t                 est/var/my.cnf' --defaults-group-suffix '.1'   --binlog 'mysqld-bin' --gtid 'c28a1587-4df4-11e8-9152-b37ffe192a2a:0' --gtid-domain-id '0': 2                 55 (Unknown error 255)
      2018-05-02 13:37:09 0 [ERROR] WSREP: Command did not run: wsrep_sst_rsync --role 'donor' --address '127.0.0.1:16007/rsync_sst' --socket '/us                 r/share/mysql-test/var/tmp/mysqld.1.sock' --datadir '/usr/share/mysql-test/var/mysqld.1/data/'  --defaults-file '/usr/share/mysql-test/var/m                 y.cnf' --defaults-group-suffix '.1'   --binlog 'mysqld-bin' --gtid 'c28a1587-4df4-11e8-9152-b37ffe192a2a:0' --gtid-domain-id '0'
      2018-05-02 13:37:09 0 [Warning] WSREP: 0.0 (t4w6.xentio.lan): State transfer to 1.0 (t4w6.xentio.lan) failed: -255 (Unknown error 255)
      WSREP_SST: [ERROR] Parent mysqld process (PID:17384) terminated unexpectedly. (20180502 13:37:06.786)
      2018-05-02 13:37:09 0 [Warning] WSREP: 0.0 (t4w6.xentio.lan): State transfer to 1.0 (t4w6.xentio.lan) failed: -255 (Unknown error 255)
      2018-05-02 13:37:09 0 [ERROR] WSREP: gcs/src/gcs_group.cpp:gcs_group_handle_join_msg():737: Will never receive state. Need to abort.
       
      worker[1] mysql-test-run: WARNING: Process [mysqld.2 - pid: 17795, winpid: 17795, exit: 256] died after mysql-test-run waited 12.5 seconds f                 or /usr/share/mysql-test/var/run/mysqld.2.pid to be created.
      galera.MW-86-wait8 'innodb'              [ fail ]
              Test ended at 2018-05-02 13:37:33
       
      CURRENT_TEST: galera.galera_binlog_checksum
      CURRENT_TEST: galera.MW-313
      CURRENT_TEST: galera.MW-86-wait1
      CURRENT_TEST: galera.MW-86-wait8
       
       
      Failed to start mysqld.2
       
       
       - saving '/usr/share/mysql-test/var/log/galera.MW-86-wait8-innodb/' to '/usr/share/mysql-test/var/log/galera.MW-86-wait8-innodb/'
      ***Warnings generated in error logs during shutdown after running tests: galera.MW-86-wait8
       
      WSREP_SST: [ERROR] rsync returned code 23: (20180502 13:37:23.175)
      2018-05-02 13:37:23 0 [ERROR] WSREP: Failed to read from: wsrep_sst_rsync --role 'donor' --address '127.0.0.1:16007/rsync_sst' --socket '/us                 r/share/mysql-test/var/tmp/mysqld.1.sock' --datadir '/usr/share/mysql-test/var/mysqld.1/data/'  --defaults-file '/usr/share/mysql-test/var/m                 y.cnf' --defaults-group-suffix '.1'   --binlog 'mysqld-bin' --gtid 'cada21ce-4df4-11e8-96e0-33396eb534e9:0' --gtid-domain-id '0'
      2018-05-02 13:37:23 0 [ERROR] WSREP: Process completed with error: wsrep_sst_rsync --role 'donor' --address '127.0.0.1:16007/rsync_sst' --so                 cket '/usr/share/mysql-test/var/tmp/mysqld.1.sock' --datadir '/usr/share/mysql-test/var/mysqld.1/data/'  --defaults-file '/usr/share/mysql-t                 est/var/my.cnf' --defaults-group-suffix '.1'   --binlog 'mysqld-bin' --gtid 'cada21ce-4df4-11e8-96e0-33396eb534e9:0' --gtid-domain-id '0': 2                 55 (Unknown error 255)
      2018-05-02 13:37:23 0 [ERROR] WSREP: Command did not run: wsrep_sst_rsync --role 'donor' --address '127.0.0.1:16007/rsync_sst' --socket '/us                 r/share/mysql-test/var/tmp/mysqld.1.sock' --datadir '/usr/share/mysql-test/var/mysqld.1/data/'  --defaults-file '/usr/share/mysql-test/var/m                 y.cnf' --defaults-group-suffix '.1'   --binlog 'mysqld-bin' --gtid 'cada21ce-4df4-11e8-96e0-33396eb534e9:0' --gtid-domain-id '0'
      2018-05-02 13:37:23 0 [Warning] WSREP: 0.0 (t4w6.xentio.lan): State transfer to 1.0 (t4w6.xentio.lan) failed: -255 (Unknown error 255)
      WSREP_SST: [ERROR] Parent mysqld process (PID:17590) terminated unexpectedly. (20180502 13:37:20.311)
      2018-05-02 13:37:23 0 [Warning] WSREP: 0.0 (t4w6.xentio.lan): State transfer to 1.0 (t4w6.xentio.lan) failed: -255 (Unknown error 255)
      2018-05-02 13:37:23 0 [ERROR] WSREP: gcs/src/gcs_group.cpp:gcs_group_handle_join_msg():737: Will never receive state. Need to abort.
       
      worker[1] mysql-test-run: WARNING: Process [mysqld.2 - pid: 18001, winpid: 18001, exit: 256] died after mysql-test-run waited 12.3 seconds f                 or /usr/share/mysql-test/var/run/mysqld.2.pid to be created.
      galera.galera_binlog_event_max_size_min 'innodb' [ fail ]
              Test ended at 2018-05-02 13:37:46
       
      CURRENT_TEST: galera.galera_binlog_checksum
      CURRENT_TEST: galera.MW-313
      CURRENT_TEST: galera.MW-86-wait1
      CURRENT_TEST: galera.MW-86-wait8
      CURRENT_TEST: galera.galera_binlog_event_max_size_min
       
       
      Failed to start mysqld.2
       
       
       - saving '/usr/share/mysql-test/var/log/galera.galera_binlog_event_max_size_min-innodb/' to '/usr/share/mysql-test/var/log/galera.galera_bi                 nlog_event_max_size_min-innodb/'
      ***Warnings generated in error logs during shutdown after running tests: galera.galera_binlog_event_max_size_min
       
      WSREP_SST: [ERROR] rsync returned code 23: (20180502 13:37:36.447)
      2018-05-02 13:37:36 0 [ERROR] WSREP: Failed to read from: wsrep_sst_rsync --role 'donor' --address '127.0.0.1:16007/rsync_sst' --socket '/us                 r/share/mysql-test/var/tmp/mysqld.1.sock' --datadir '/usr/share/mysql-test/var/mysqld.1/data/'  --defaults-file '/usr/share/mysql-test/var/m                 y.cnf' --defaults-group-suffix '.1'    '' --gtid 'd2e0630d-4df4-11e8-861c-725486b65246:0' --gtid-domain-id '0'
      2018-05-02 13:37:36 0 [ERROR] WSREP: Process completed with error: wsrep_sst_rsync --role 'donor' --address '127.0.0.1:16007/rsync_sst' --so                 cket '/usr/share/mysql-test/var/tmp/mysqld.1.sock' --datadir '/usr/share/mysql-test/var/mysqld.1/data/'  --defaults-file '/usr/share/mysql-t                 est/var/my.cnf' --defaults-group-suffix '.1'    '' --gtid 'd2e0630d-4df4-11e8-861c-725486b65246:0' --gtid-domain-id '0': 255 (Unknown error                  255)
      2018-05-02 13:37:36 0 [ERROR] WSREP: Command did not run: wsrep_sst_rsync --role 'donor' --address '127.0.0.1:16007/rsync_sst' --socket '/us                 r/share/mysql-test/var/tmp/mysqld.1.sock' --datadir '/usr/share/mysql-test/var/mysqld.1/data/'  --defaults-file '/usr/share/mysql-test/var/m                 y.cnf' --defaults-group-suffix '.1'    '' --gtid 'd2e0630d-4df4-11e8-861c-725486b65246:0' --gtid-domain-id '0'
      2018-05-02 13:37:36 0 [Warning] WSREP: 0.0 (t4w6.xentio.lan): State transfer to 1.0 (t4w6.xentio.lan) failed: -255 (Unknown error 255)
      WSREP_SST: [ERROR] Parent mysqld process (PID:17796) terminated unexpectedly. (20180502 13:37:34.116)
      2018-05-02 13:37:36 0 [Warning] WSREP: 0.0 (t4w6.xentio.lan): State transfer to 1.0 (t4w6.xentio.lan) failed: -255 (Unknown error 255)
      2018-05-02 13:37:36 0 [ERROR] WSREP: gcs/src/gcs_group.cpp:gcs_group_handle_join_msg():737: Will never receive state. Need to abort.
      WSREP_SST: [ERROR] Parent mysqld process (PID:18002) terminated unexpectedly. (20180502 13:37:46.576)
       
      worker[1] mysql-test-run: WARNING: Process [mysqld.2 - pid: 18202, winpid: 18202, exit: 256] died after mysql-test-run waited 12.4 seconds f                 or /usr/share/mysql-test/var/run/mysqld.2.pid to be created.
      galera.galera_binlog_event_max_size_max 'innodb' [ fail ]
              Test ended at 2018-05-02 13:37:59
       
      CURRENT_TEST: galera.galera_binlog_checksum
      CURRENT_TEST: galera.MW-313
      CURRENT_TEST: galera.MW-86-wait1
      CURRENT_TEST: galera.MW-86-wait8
      CURRENT_TEST: galera.galera_binlog_event_max_size_min
      CURRENT_TEST: galera.galera_binlog_event_max_size_max
       
       
      Failed to start mysqld.2
       
       
       - saving '/usr/share/mysql-test/var/log/galera.galera_binlog_event_max_size_max-innodb/' to '/usr/share/mysql-test/var/log/galera.galera_bi                 nlog_event_max_size_max-innodb/'
      ***Warnings generated in error logs during shutdown after running tests: galera.galera_binlog_event_max_size_max
       
      WSREP_SST: [ERROR] rsync returned code 23: (20180502 13:37:49.724)
      2018-05-02 13:37:49 0 [ERROR] WSREP: Failed to read from: wsrep_sst_rsync --role 'donor' --address '127.0.0.1:16007/rsync_sst' --socket '/us                 r/share/mysql-test/var/tmp/mysqld.1.sock' --datadir '/usr/share/mysql-test/var/mysqld.1/data/'  --defaults-file '/usr/share/mysql-test/var/m                 y.cnf' --defaults-group-suffix '.1'    '' --gtid 'dabf0e90-4df4-11e8-9755-6e81b1c98cba:0' --gtid-domain-id '0'
      2018-05-02 13:37:49 0 [ERROR] WSREP: Process completed with error: wsrep_sst_rsync --role 'donor' --address '127.0.0.1:16007/rsync_sst' --so                 cket '/usr/share/mysql-test/var/tmp/mysqld.1.sock' --datadir '/usr/share/mysql-test/var/mysqld.1/data/'  --defaults-file '/usr/share/mysql-t                 est/var/my.cnf' --defaults-group-suffix '.1'    '' --gtid 'dabf0e90-4df4-11e8-9755-6e81b1c98cba:0' --gtid-domain-id '0': 255 (Unknown error                  255)
      2018-05-02 13:37:49 0 [ERROR] WSREP: Command did not run: wsrep_sst_rsync --role 'donor' --address '127.0.0.1:16007/rsync_sst' --socket '/us                 r/share/mysql-test/var/tmp/mysqld.1.sock' --datadir '/usr/share/mysql-test/var/mysqld.1/data/'  --defaults-file '/usr/share/mysql-test/var/m                 y.cnf' --defaults-group-suffix '.1'    '' --gtid 'dabf0e90-4df4-11e8-9755-6e81b1c98cba:0' --gtid-domain-id '0'
      2018-05-02 13:37:49 0 [Warning] WSREP: 0.0 (t4w6.xentio.lan): State transfer to 1.0 (t4w6.xentio.lan) failed: -255 (Unknown error 255)
      2018-05-02 13:37:49 0 [Warning] WSREP: 0.0 (t4w6.xentio.lan): State transfer to 1.0 (t4w6.xentio.lan) failed: -255 (Unknown error 255)
      2018-05-02 13:37:49 0 [ERROR] WSREP: gcs/src/gcs_group.cpp:gcs_group_handle_join_msg():737: Will never receive state. Need to abort.
      WSREP_SST: [ERROR] Parent mysqld process (PID:18203) terminated unexpectedly. (20180502 13:37:59.796)
       
      worker[1] mysql-test-run: WARNING: Process [mysqld.2 - pid: 18395, winpid: 18395, exit: 256] died after mysql-test-run waited 12.3 seconds f                 or /usr/share/mysql-test/var/run/mysqld.2.pid to be created.
      galera.enforce_storage_engine2 'innodb'  [ fail ]
              Test ended at 2018-05-02 13:38:13
       
      CURRENT_TEST: galera.galera_binlog_checksum
      CURRENT_TEST: galera.MW-313
      CURRENT_TEST: galera.MW-86-wait1
      CURRENT_TEST: galera.MW-86-wait8
      CURRENT_TEST: galera.galera_binlog_event_max_size_min
      CURRENT_TEST: galera.galera_binlog_event_max_size_max
      CURRENT_TEST: galera.enforce_storage_engine2
       
       
      Failed to start mysqld.2
       
       
       - saving '/usr/share/mysql-test/var/log/galera.enforce_storage_engine2-innodb/' to '/usr/share/mysql-test/var/log/galera.enforce_storage_en                 gine2-innodb/'
      ***Warnings generated in error logs during shutdown after running tests: galera.enforce_storage_engine2
       
      WSREP_SST: [ERROR] rsync returned code 23: (20180502 13:38:03.068)
      2018-05-02 13:38:03 0 [ERROR] WSREP: Failed to read from: wsrep_sst_rsync --role 'donor' --address '127.0.0.1:16007/rsync_sst' --socket '/us                 r/share/mysql-test/var/tmp/mysqld.1.sock' --datadir '/usr/share/mysql-test/var/mysqld.1/data/'  --defaults-file '/usr/share/mysql-test/var/m                 y.cnf' --defaults-group-suffix '.1'    '' --gtid 'e2b11aac-4df4-11e8-8656-8e47d4d77e20:0' --gtid-domain-id '0'
      2018-05-02 13:38:03 0 [ERROR] WSREP: Process completed with error: wsrep_sst_rsync --role 'donor' --address '127.0.0.1:16007/rsync_sst' --so                 cket '/usr/share/mysql-test/var/tmp/mysqld.1.sock' --datadir '/usr/share/mysql-test/var/mysqld.1/data/'  --defaults-file '/usr/share/mysql-t                 est/var/my.cnf' --defaults-group-suffix '.1'    '' --gtid 'e2b11aac-4df4-11e8-8656-8e47d4d77e20:0' --gtid-domain-id '0': 255 (Unknown error                  255)
      2018-05-02 13:38:03 0 [ERROR] WSREP: Command did not run: wsrep_sst_rsync --role 'donor' --address '127.0.0.1:16007/rsync_sst' --socket '/us                 r/share/mysql-test/var/tmp/mysqld.1.sock' --datadir '/usr/share/mysql-test/var/mysqld.1/data/'  --defaults-file '/usr/share/mysql-test/var/m                 y.cnf' --defaults-group-suffix '.1'    '' --gtid 'e2b11aac-4df4-11e8-8656-8e47d4d77e20:0' --gtid-domain-id '0'
      2018-05-02 13:38:03 0 [Warning] WSREP: 0.0 (t4w6.xentio.lan): State transfer to 1.0 (t4w6.xentio.lan) failed: -255 (Unknown error 255)
      2018-05-02 13:38:03 0 [Warning] WSREP: 0.0 (t4w6.xentio.lan): State transfer to 1.0 (t4w6.xentio.lan) failed: -255 (Unknown error 255)
      2018-05-02 13:38:03 0 [ERROR] WSREP: gcs/src/gcs_group.cpp:gcs_group_handle_join_msg():737: Will never receive state. Need to abort.
      WSREP_SST: [ERROR] Parent mysqld process (PID:18396) terminated unexpectedly. (20180502 13:38:13.179)
       
      worker[1] mysql-test-run: WARNING: Process [mysqld.2 - pid: 18588, winpid: 18588, exit: 256] died after mysql-test-run waited 12.4 seconds for /usr/share/mysql-test/var/run/mysqld.2.pid to be created.
      galera.galera_log_output_csv 'innodb'    [ fail ]
              Test ended at 2018-05-02 13:38:26
       
      CURRENT_TEST: galera.galera_binlog_checksum
      CURRENT_TEST: galera.MW-313
      CURRENT_TEST: galera.MW-86-wait1
      CURRENT_TEST: galera.MW-86-wait8
      CURRENT_TEST: galera.galera_binlog_event_max_size_min
      CURRENT_TEST: galera.galera_binlog_event_max_size_max
      CURRENT_TEST: galera.enforce_storage_engine2
      CURRENT_TEST: galera.galera_log_output_csv
       
       
      Failed to start mysqld.2
       
       
       - saving '/usr/share/mysql-test/var/log/galera.galera_log_output_csv-innodb/' to '/usr/share/mysql-test/var/log/galera.galera_log_output_csv-innodb/'
      ***Warnings generated in error logs during shutdown after running tests: galera.galera_log_output_csv
       
      2018-05-02 13:38:13 0 [Warning] Although a path was specified for the --log option, log tables are used. To enable logging to files use the --log-output option.
      2018-05-02 13:38:13 0 [Warning] Although a path was specified for the --log-slow-queries option, log tables are used. To enable logging to files use the --log-output=file option.
      WSREP_SST: [ERROR] rsync returned code 23: (20180502 13:38:16.328)
      2018-05-02 13:38:16 0 [ERROR] WSREP: Failed to read from: wsrep_sst_rsync --role 'donor' --address '127.0.0.1:16007/rsync_sst' --socket '/usr/share/mysql-test/var/tmp/mysqld.1.sock' --datadir '/usr/share/mysql-test/var/mysqld.1/data/'  --defaults-file '/usr/share/mysql-test/var/my.cnf' --defaults-group-suffix '.1'    '' --gtid 'ea97d155-4df4-11e8-af8b-0291f3dfb9a0:0' --gtid-domain-id '0'
      2018-05-02 13:38:16 0 [ERROR] WSREP: Process completed with error: wsrep_sst_rsync --role 'donor' --address '127.0.0.1:16007/rsync_sst' --socket '/usr/share/mysql-test/var/tmp/mysqld.1.sock' --datadir '/usr/share/mysql-test/var/mysqld.1/data/'  --defaults-file '/usr/share/mysql-test/var/my.cnf' --defaults-group-suffix '.1'    '' --gtid 'ea97d155-4df4-11e8-af8b-0291f3dfb9a0:0' --gtid-domain-id '0': 255 (Unknown error 255)
      2018-05-02 13:38:16 0 [ERROR] WSREP: Command did not run: wsrep_sst_rsync --role 'donor' --address '127.0.0.1:16007/rsync_sst' --socket '/usr/share/mysql-test/var/tmp/mysqld.1.sock' --datadir '/usr/share/mysql-test/var/mysqld.1/data/'  --defaults-file '/usr/share/mysql-test/var/my.cnf' --defaults-group-suffix '.1'    '' --gtid 'ea97d155-4df4-11e8-af8b-0291f3dfb9a0:0' --gtid-domain-id '0'
      2018-05-02 13:38:16 0 [Warning] WSREP: 0.0 (t4w6.xentio.lan): State transfer to 1.0 (t4w6.xentio.lan) failed: -255 (Unknown error 255)
      2018-05-02 13:38:13 0 [Warning] Although a path was specified for the --log option, log tables are used. To enable logging to files use the --log-output option.
      2018-05-02 13:38:13 0 [Warning] Although a path was specified for the --log-slow-queries option, log tables are used. To enable logging to files use the --log-output=file option.
      2018-05-02 13:38:16 0 [Warning] WSREP: 0.0 (t4w6.xentio.lan): State transfer to 1.0 (t4w6.xentio.lan) failed: -255 (Unknown error 255)
      2018-05-02 13:38:16 0 [ERROR] WSREP: gcs/src/gcs_group.cpp:gcs_group_handle_join_msg():737: Will never receive state. Need to abort.
      WSREP_SST: [ERROR] Parent mysqld process (PID:18589) terminated unexpectedly. (20180502 13:38:26.369)
       
      worker[1] mysql-test-run: WARNING: Process [mysqld.2 - pid: 18781, winpid: 18781, exit: 256] died after mysql-test-run waited 12.4 seconds for /usr/share/mysql-test/var/run/mysqld.2.pid to be created.
      galera.galera_mdev_13787 'innodb'        [ fail ]
              Test ended at 2018-05-02 13:38:39
       
      CURRENT_TEST: galera.galera_binlog_checksum
      CURRENT_TEST: galera.MW-313
      CURRENT_TEST: galera.MW-86-wait1
      CURRENT_TEST: galera.MW-86-wait8
      CURRENT_TEST: galera.galera_binlog_event_max_size_min
      CURRENT_TEST: galera.galera_binlog_event_max_size_max
      CURRENT_TEST: galera.enforce_storage_engine2
      CURRENT_TEST: galera.galera_log_output_csv
      CURRENT_TEST: galera.galera_mdev_13787
       
       
      Failed to start mysqld.2
       
       
       - saving '/usr/share/mysql-test/var/log/galera.galera_mdev_13787-innodb/' to '/usr/share/mysql-test/var/log/galera.galera_mdev_13787-innodb/'
      ***Warnings generated in error logs during shutdown after running tests: galera.galera_mdev_13787
       
      WSREP_SST: [ERROR] rsync returned code 23: (20180502 13:38:29.703)
      2018-05-02 13:38:29 0 [ERROR] WSREP: Failed to read from: wsrep_sst_rsync --role 'donor' --address '127.0.0.1:16007/rsync_sst' --socket '/usr/share/mysql-test/var/tmp/mysqld.1.sock' --datadir '/usr/share/mysql-test/var/mysqld.1/data/'  --defaults-file '/usr/share/mysql-test/var/my.cnf' --defaults-group-suffix '.1'    '' --gtid 'f28bf461-4df4-11e8-a81e-4bc84d0b2340:0' --gtid-domain-id '0'
      2018-05-02 13:38:29 0 [ERROR] WSREP: Process completed with error: wsrep_sst_rsync --role 'donor' --address '127.0.0.1:16007/rsync_sst' --socket '/usr/share/mysql-test/var/tmp/mysqld.1.sock' --datadir '/usr/share/mysql-test/var/mysqld.1/data/'  --defaults-file '/usr/share/mysql-test/var/my.cnf' --defaults-group-suffix '.1'    '' --gtid 'f28bf461-4df4-11e8-a81e-4bc84d0b2340:0' --gtid-domain-id '0': 255 (Unknown error 255)
      2018-05-02 13:38:29 0 [ERROR] WSREP: Command did not run: wsrep_sst_rsync --role 'donor' --address '127.0.0.1:16007/rsync_sst' --socket '/usr/share/mysql-test/var/tmp/mysqld.1.sock' --datadir '/usr/share/mysql-test/var/mysqld.1/data/'  --defaults-file '/usr/share/mysql-test/var/my.cnf' --defaults-group-suffix '.1'    '' --gtid 'f28bf461-4df4-11e8-a81e-4bc84d0b2340:0' --gtid-domain-id '0'
      2018-05-02 13:38:29 0 [Warning] WSREP: 0.0 (t4w6.xentio.lan): State transfer to 1.0 (t4w6.xentio.lan) failed: -255 (Unknown error 255)
      2018-05-02 13:38:29 0 [Warning] WSREP: 0.0 (t4w6.xentio.lan): State transfer to 1.0 (t4w6.xentio.lan) failed: -255 (Unknown error 255)
      2018-05-02 13:38:29 0 [ERROR] WSREP: gcs/src/gcs_group.cpp:gcs_group_handle_join_msg():737: Will never receive state. Need to abort.
      WSREP_SST: [ERROR] Parent mysqld process (PID:18782) terminated unexpectedly. (20180502 13:38:39.793)
       
      worker[1] mysql-test-run: WARNING: Process [mysqld.2 - pid: 18974, winpid: 18974, exit: 256] died after mysql-test-run waited 12.3 seconds for /usr/share/mysql-test/var/run/mysqld.2.pid to be created.
      galera.galera_applier_ftwrl_table_alter 'innodb' [ fail ]
              Test ended at 2018-05-02 13:38:53
       
      CURRENT_TEST: galera.galera_binlog_checksum
      CURRENT_TEST: galera.MW-313
      CURRENT_TEST: galera.MW-86-wait1
      CURRENT_TEST: galera.MW-86-wait8
      CURRENT_TEST: galera.galera_binlog_event_max_size_min
      CURRENT_TEST: galera.galera_binlog_event_max_size_max
      CURRENT_TEST: galera.enforce_storage_engine2
      CURRENT_TEST: galera.galera_log_output_csv
      CURRENT_TEST: galera.galera_mdev_13787
      CURRENT_TEST: galera.galera_applier_ftwrl_table_alter
       
       
      Failed to start mysqld.2
       
       
       - saving '/usr/share/mysql-test/var/log/galera.galera_applier_ftwrl_table_alter-innodb/' to '/usr/share/mysql-test/var/log/galera.galera_applier_ftwrl_table_alter-innodb/'
      Too many tests(10) failed! Terminating...
       
      Only  47  of 263 completed.
      --------------------------------------------------------------------------
      The servers were restarted 9 times
      Spent 0.000 of 143 seconds executing testcases
       
      Too many failed: Failed 10/10 tests, 0.00% were successful.
       
      Failing test(s): galera.galera_binlog_checksum galera.MW-313 galera.MW-86-wait1 galera.MW-86-wait8 galera.galera_binlog_event_max_size_min galera.galera_binlog_event_max_size_max galera.enforce_storage_engine2 galera.galera_log_output_csv galera.galera_mdev_13787 galera.galera_applier_ftwrl_table_alter
       
      The log files in var/log may give you some hint of what went wrong.
       
      If you want to report this error, please read first the documentation
      at http://dev.mysql.com/doc/mysql/en/mysql-test-suite.html
       
      Errors/warnings were found in logfiles during server shutdown after running the
      following sequence(s) of tests:
          galera.galera_binlog_checksum
          galera.MW-313
          galera.MW-86-wait1
          galera.MW-86-wait8
          galera.galera_binlog_event_max_size_min
          galera.galera_binlog_event_max_size_max
          galera.enforce_storage_engine2
          galera.galera_log_output_csv
          galera.galera_mdev_13787
      8 tests were skipped, 0 by the test itself.
       
      mysql-test-run: *** ERROR: there were failing test cases
      
      

        Attachments

          Issue Links

            Activity

              People

              Assignee:
              stepan.patryshev Stepan Patryshev
              Reporter:
              winstone Zdravelina Sokolovska
              Votes:
              0 Vote for this issue
              Watchers:
              1 Start watching this issue

                Dates

                Created:
                Updated: