Uploaded image for project: 'MariaDB Server'
  1. MariaDB Server
  2. MDEV-14284

10.2 doesn't compile on sol10-64

    XMLWordPrintable

    Details

    • Type: Bug
    • Status: Open (View Workflow)
    • Priority: Major
    • Resolution: Unresolved
    • Affects Version/s: 10.2, 10.3
    • Fix Version/s: 10.2, 10.3, 10.4
    • Component/s: Compiling
    • Labels:
      None

      Description

      Fails with

      /export/home/buildbot/maria-slave/solaris10-x86/build/mariadb-10.2.11/libmariadb/libmariadb/mariadb_lib.c: In function `mysql_optionsv':
      /export/home/buildbot/maria-slave/solaris10-x86/build/mariadb-10.2.11/libmariadb/libmariadb/mariadb_lib.c:2669: error: `program_invocation_short_name' undeclared (first use in this function)
      /export/home/buildbot/maria-slave/solaris10-x86/build/mariadb-10.2.11/libmariadb/libmariadb/mariadb_lib.c:2669: error: (Each undeclared identifier is reported only once
      /export/home/buildbot/maria-slave/solaris10-x86/build/mariadb-10.2.11/libmariadb/libmariadb/mariadb_lib.c:2669: error: for each function it appears in.)
      /export/home/buildbot/maria-slave/solaris10-x86/build/mariadb-10.2.11/libmariadb/libmariadb/mariadb_lib.c: In function `mysql_server_init':
      /export/home/buildbot/maria-slave/solaris10-x86/build/mariadb-10.2.11/libmariadb/libmariadb/mariadb_lib.c:3551: warning: missing braces around initializer
      /export/home/buildbot/maria-slave/solaris10-x86/build/mariadb-10.2.11/libmariadb/libmariadb/mariadb_lib.c: In function `mysql_optionsv':
      /export/home/buildbot/maria-slave/solaris10-x86/build/mariadb-10.2.11/libmariadb/libmariadb/mariadb_lib.c:2669: error: `program_invocation_short_name' undeclared (first use in this function)
      /export/home/buildbot/maria-slave/solaris10-x86/build/mariadb-10.2.11/libmariadb/libmariadb/mariadb_lib.c:2669: error: (Each undeclared identifier is reported only once
      /export/home/buildbot/maria-slave/solaris10-x86/build/mariadb-10.2.11/libmariadb/libmariadb/mariadb_lib.c:2669: error: for each function it appears in.)
      /export/home/buildbot/maria-slave/solaris10-x86/build/mariadb-10.2.11/libmariadb/libmariadb/mariadb_lib.c: In function `mysql_server_init':
      /export/home/buildbot/maria-slave/solaris10-x86/build/mariadb-10.2.11/libmariadb/libmariadb/mariadb_lib.c:3551: warning: missing braces around initializer
      /export/home/buildbot/maria-slave/solaris10-x86/build/mariadb-10.2.11/libmariadb/libmariadb/mariadb_lib.c:3551: warning: (near initialization for `init_once.__pthread_once_pad')
      /export/home/buildbot/maria-slave/solaris10-x86/build/mariadb-10.2.11/libmariadb/libmariadb/mariadb_lib.c:3551: warning: (near initialization for `init_once.__pthread_once_pad')
      gmake[2]: *** [libmariadb/libmariadb/CMakeFiles/libmariadb.dir/mariadb_lib.c.o] Error 1
      gmake[1]: *** [libmariadb/libmariadb/CMakeFiles/libmariadb.dir/all] Error 2
      gmake[1]: *** Waiting for unfinished jobs....
      

        Attachments

          Issue Links

            Activity

              People

              Assignee:
              georg Georg Richter
              Reporter:
              serg Sergei Golubchik
              Votes:
              0 Vote for this issue
              Watchers:
              1 Start watching this issue

                Dates

                Created:
                Updated: