Uploaded image for project: 'MariaDB Server'
  1. MariaDB Server
  2. MDEV-11243

10.2 server does not compile on precise-amd64 in buildbot

    Details

    • Type: Bug
    • Status: Closed (View Workflow)
    • Priority: Major
    • Resolution: Fixed
    • Affects Version/s: 10.2
    • Fix Version/s: N/A
    • Component/s: Compiling
    • Labels:
      None
    • Sprint:
      10.2.4-3

      Description

      It started happening with this build:
      http://buildbot.askmonty.org/buildbot/builders/kvm-deb-precise-amd64/builds/7302

      -- Check for working C compiler: /usr/bin/x86_64-linux-gnu-gcc
      -- Check for working C compiler: /usr/bin/x86_64-linux-gnu-gcc -- broken
      CMake Error at /usr/local/share/cmake-2.8/Modules/CMakeTestCCompiler.cmake:61 (message):
        The C compiler "/usr/bin/x86_64-linux-gnu-gcc" is not able to compile a
        simple test program.
       
        It fails with the following output:
       
         Change Dir: /home/buildbot/buildbot/build/mariadb-10.2.3/builddir/CMakeFiles/CMakeTmp
       
        
       
        Run Build Command:/usr/bin/make "cmTryCompileExec1892151700/fast"
       
        make[2]: Entering directory
        `/home/buildbot/buildbot/build/mariadb-10.2.3/builddir/CMakeFiles/CMakeTmp'
       
       
        /usr/bin/make -f CMakeFiles/cmTryCompileExec1892151700.dir/build.make
        CMakeFiles/cmTryCompileExec1892151700.dir/build
       
        make[3]: Entering directory
        `/home/buildbot/buildbot/build/mariadb-10.2.3/builddir/CMakeFiles/CMakeTmp'
       
       
        /usr/local/bin/cmake -E cmake_progress_report
        /home/buildbot/buildbot/build/mariadb-10.2.3/builddir/CMakeFiles/CMakeTmp/CMakeFiles
        1
       
        Building C object
        CMakeFiles/cmTryCompileExec1892151700.dir/testCCompiler.c.o
       
        /usr/bin/x86_64-linux-gnu-gcc -g -O2 -fstack-protector
        --param=ssp-buffer-size=4 -Wformat -Wformat-security
        -Werror=format-security -o
        CMakeFiles/cmTryCompileExec1892151700.dir/testCCompiler.c.o -c
        /home/buildbot/buildbot/build/mariadb-10.2.3/builddir/CMakeFiles/CMakeTmp/testCCompiler.c
       
       
        Linking C executable cmTryCompileExec1892151700
       
        /usr/local/bin/cmake -E cmake_link_script
        CMakeFiles/cmTryCompileExec1892151700.dir/link.txt --verbose=1
       
        /usr/bin/x86_64-linux-gnu-gcc -g -O2 -fstack-protector
        --param=ssp-buffer-size=4 -Wformat -Wformat-security
        -Werror=format-security -Wl,-Bsymbolic-functions -Wl,-z,relro -Wl,-z,now
        CMakeFiles/cmTryCompileExec1892151700.dir/testCCompiler.c.o -o
        cmTryCompileExec1892151700 -rdynamic
       
        /usr/local/bin/ld: this linker was not configured to use sysroots
       
        collect2: ld returned 1 exit status
       
        make[3]: Leaving directory
        `/home/buildbot/buildbot/build/mariadb-10.2.3/builddir/CMakeFiles/CMakeTmp'
       
       
        make[3]: *** [cmTryCompileExec1892151700] Error 1
       
        make[2]: Leaving directory
        `/home/buildbot/buildbot/build/mariadb-10.2.3/builddir/CMakeFiles/CMakeTmp'
       
       
        make[2]: *** [cmTryCompileExec1892151700/fast] Error 2
       
        
       
        
       
        CMake will not be able to correctly generate this project.
      Call Stack (most recent call first):
        CMakeLists.txt:90 (PROJECT)
       
       
      -- Configuring incomplete, errors occurred!
      See also "/home/buildbot/buildbot/build/mariadb-10.2.3/builddir/CMakeFiles/CMakeOutput.log".
      See also "/home/buildbot/buildbot/build/mariadb-10.2.3/builddir/CMakeFiles/CMakeError.log".
      make[1]: *** [override_dh_auto_configure] Error 1
      make[1]: Leaving directory `/home/buildbot/buildbot/build/mariadb-10.2.3'
      make: *** [build] Error 2
      dpkg-buildpackage: error: debian/rules build gave error exit status 2
      

        Attachments

          Issue Links

            Activity

              People

              • Assignee:
                dbart Daniel Bartholomew
                Reporter:
                elenst Elena Stepanova
              • Votes:
                0 Vote for this issue
                Watchers:
                4 Start watching this issue

                Dates

                • Created:
                  Updated:
                  Resolved: